{"text_format":"1","workbook":"xlsx","n_sheets":7,"sheets":["Dashboard","Daten","Daten_Auswahl","Bev_15_20","Bev_15_20_Auswahl","Wappen","Stage"],"not_rendered":{"charts":2,"images":19,"macros":1,"external_links":0,"defined_names":57,"comments":0,"pivot_tables":0},"unopened":[],"bounds":{"document_bytes":16777216,"sheet_cells":100000,"rows_first":2000,"rows_last":500,"rows_between":2000,"halvings":0,"cell_chars":16384,"cell_head_chars":4096},"cells_cut":0,"cells_raw":0,"read":"whole","date_system":"1900"}

{"sheet":"Dashboard","index":0,"n_rows":30,"n_cols":13,"rows_kept":30,"cut":false,"hidden":false,"merged":[]}
[]
[null,"Lehrlinge nach Bundesländern und Sparten, Stichtag 31. Dezember 1"]
[null,"Quelle: Lehrlingsstatistik, Wirtschaftskammern Österreichs, Statistik"]
[null,"Auswahl:"]
[null,{"$f":"Auswahl_Bundesland","v":"ÖSTERREICH"}]
[]
[null,"Jahr",null,"Insgesamt","Gewerbe und Handwerk","Industrie","Handel","Bank und Versicherung","Transport und Verkehr","Tourismus und Freizeitwirtschaft","Information und Consulting","Sonstige Lehrberechtigte","Überbetriebliche Lehrausbildung 2"]
[null,{"$f":"OFFSET(Daten_Auswahl!B8,Scrollbar,0)","v":2016},null,{"$f":"OFFSET(Daten_Auswahl!L8,Scrollbar,OptionButtonMultiplier)","v":106950},{"$f":"OFFSET(Daten_Auswahl!C8,Scrollbar,OptionButtonMultiplier)","v":44909},{"$f":"OFFSET(Daten_Auswahl!D8,Scrollbar,OptionButtonMultiplier)","v":15079},{"$f":"OFFSET(Daten_Auswahl!E8,Scrollbar,OptionButtonMultiplier)","v":15055},{"$f":"OFFSET(Daten_Auswahl!F8,Scrollbar,OptionButtonMultiplier)","v":1151},{"$f":"OFFSET(Daten_Auswahl!G8,Scrollbar,OptionButtonMultiplier)","v":2648},{"$f":"OFFSET(Daten_Auswahl!H8,Scrollbar,OptionButtonMultiplier)","v":8788},{"$f":"OFFSET(Daten_Auswahl!I8,Scrollbar,OptionButtonMultiplier)","v":2143},{"$f":"OFFSET(Daten_Auswahl!J8,Scrollbar,OptionButtonMultiplier)","v":7933},{"$f":"OFFSET(Daten_Auswahl!K8,Scrollbar,OptionButtonMultiplier)","v":9244}]
[null,{"$f":"OFFSET(Daten_Auswahl!B9,Scrollbar,0)","v":2017},null,{"$f":"OFFSET(Daten_Auswahl!L9,Scrollbar,OptionButtonMultiplier)","v":106613},{"$f":"OFFSET(Daten_Auswahl!C9,Scrollbar,OptionButtonMultiplier)","v":44602},{"$f":"OFFSET(Daten_Auswahl!D9,Scrollbar,OptionButtonMultiplier)","v":15159},{"$f":"OFFSET(Daten_Auswahl!E9,Scrollbar,OptionButtonMultiplier)","v":14892},{"$f":"OFFSET(Daten_Auswahl!F9,Scrollbar,OptionButtonMultiplier)","v":1135},{"$f":"OFFSET(Daten_Auswahl!G9,Scrollbar,OptionButtonMultiplier)","v":2753},{"$f":"OFFSET(Daten_Auswahl!H9,Scrollbar,OptionButtonMultiplier)","v":8905},{"$f":"OFFSET(Daten_Auswahl!I9,Scrollbar,OptionButtonMultiplier)","v":2185},{"$f":"OFFSET(Daten_Auswahl!J9,Scrollbar,OptionButtonMultiplier)","v":7881},{"$f":"OFFSET(Daten_Auswahl!K9,Scrollbar,OptionButtonMultiplier)","v":9101}]
[null,{"$f":"OFFSET(Daten_Auswahl!B10,Scrollbar,0)","v":2018},null,{"$f":"OFFSET(Daten_Auswahl!L10,Scrollbar,OptionButtonMultiplier)","v":107915},{"$f":"OFFSET(Daten_Auswahl!C10,Scrollbar,OptionButtonMultiplier)","v":45744},{"$f":"OFFSET(Daten_Auswahl!D10,Scrollbar,OptionButtonMultiplier)","v":15754},{"$f":"OFFSET(Daten_Auswahl!E10,Scrollbar,OptionButtonMultiplier)","v":14957},{"$f":"OFFSET(Daten_Auswahl!F10,Scrollbar,OptionButtonMultiplier)","v":1128},{"$f":"OFFSET(Daten_Auswahl!G10,Scrollbar,OptionButtonMultiplier)","v":2816},{"$f":"OFFSET(Daten_Auswahl!H10,Scrollbar,OptionButtonMultiplier)","v":9048},{"$f":"OFFSET(Daten_Auswahl!I10,Scrollbar,OptionButtonMultiplier)","v":2335},{"$f":"OFFSET(Daten_Auswahl!J10,Scrollbar,OptionButtonMultiplier)","v":7831},{"$f":"OFFSET(Daten_Auswahl!K10,Scrollbar,OptionButtonMultiplier)","v":8302}]
[null,{"$f":"OFFSET(Daten_Auswahl!B11,Scrollbar,0)","v":2019},null,{"$f":"OFFSET(Daten_Auswahl!L11,Scrollbar,OptionButtonMultiplier)","v":109111},{"$f":"OFFSET(Daten_Auswahl!C11,Scrollbar,OptionButtonMultiplier)","v":46390},{"$f":"OFFSET(Daten_Auswahl!D11,Scrollbar,OptionButtonMultiplier)","v":16446},{"$f":"OFFSET(Daten_Auswahl!E11,Scrollbar,OptionButtonMultiplier)","v":15283},{"$f":"OFFSET(Daten_Auswahl!F11,Scrollbar,OptionButtonMultiplier)","v":1222},{"$f":"OFFSET(Daten_Auswahl!G11,Scrollbar,OptionButtonMultiplier)","v":2869},{"$f":"OFFSET(Daten_Auswahl!H11,Scrollbar,OptionButtonMultiplier)","v":8910},{"$f":"OFFSET(Daten_Auswahl!I11,Scrollbar,OptionButtonMultiplier)","v":2509},{"$f":"OFFSET(Daten_Auswahl!J11,Scrollbar,OptionButtonMultiplier)","v":8060},{"$f":"OFFSET(Daten_Auswahl!K11,Scrollbar,OptionButtonMultiplier)","v":7422}]
[null,{"$f":"OFFSET(Daten_Auswahl!B12,Scrollbar,0)","v":2020},null,{"$f":"OFFSET(Daten_Auswahl!L12,Scrollbar,OptionButtonMultiplier)","v":108416},{"$f":"OFFSET(Daten_Auswahl!C12,Scrollbar,OptionButtonMultiplier)","v":46659},{"$f":"OFFSET(Daten_Auswahl!D12,Scrollbar,OptionButtonMultiplier)","v":16389},{"$f":"OFFSET(Daten_Auswahl!E12,Scrollbar,OptionButtonMultiplier)","v":15105},{"$f":"OFFSET(Daten_Auswahl!F12,Scrollbar,OptionButtonMultiplier)","v":1268},{"$f":"OFFSET(Daten_Auswahl!G12,Scrollbar,OptionButtonMultiplier)","v":2786},{"$f":"OFFSET(Daten_Auswahl!H12,Scrollbar,OptionButtonMultiplier)","v":7876},{"$f":"OFFSET(Daten_Auswahl!I12,Scrollbar,OptionButtonMultiplier)","v":2519},{"$f":"OFFSET(Daten_Auswahl!J12,Scrollbar,OptionButtonMultiplier)","v":8574},{"$f":"OFFSET(Daten_Auswahl!K12,Scrollbar,OptionButtonMultiplier)","v":7240}]
[null,{"$f":"OFFSET(Daten_Auswahl!B13,Scrollbar,0)","v":2021},null,{"$f":"OFFSET(Daten_Auswahl!L13,Scrollbar,OptionButtonMultiplier)","v":107593},{"$f":"OFFSET(Daten_Auswahl!C13,Scrollbar,OptionButtonMultiplier)","v":46874},{"$f":"OFFSET(Daten_Auswahl!D13,Scrollbar,OptionButtonMultiplier)","v":16239},{"$f":"OFFSET(Daten_Auswahl!E13,Scrollbar,OptionButtonMultiplier)","v":15149},{"$f":"OFFSET(Daten_Auswahl!F13,Scrollbar,OptionButtonMultiplier)","v":1188},{"$f":"OFFSET(Daten_Auswahl!G13,Scrollbar,OptionButtonMultiplier)","v":2784},{"$f":"OFFSET(Daten_Auswahl!H13,Scrollbar,OptionButtonMultiplier)","v":6914},{"$f":"OFFSET(Daten_Auswahl!I13,Scrollbar,OptionButtonMultiplier)","v":2518},{"$f":"OFFSET(Daten_Auswahl!J13,Scrollbar,OptionButtonMultiplier)","v":9047},{"$f":"OFFSET(Daten_Auswahl!K13,Scrollbar,OptionButtonMultiplier)","v":6880}]
[null,{"$f":"OFFSET(Daten_Auswahl!B14,Scrollbar,0)","v":2022},null,{"$f":"OFFSET(Daten_Auswahl!L14,Scrollbar,OptionButtonMultiplier)","v":108085},{"$f":"OFFSET(Daten_Auswahl!C14,Scrollbar,OptionButtonMultiplier)","v":46913},{"$f":"OFFSET(Daten_Auswahl!D14,Scrollbar,OptionButtonMultiplier)","v":16428},{"$f":"OFFSET(Daten_Auswahl!E14,Scrollbar,OptionButtonMultiplier)","v":15193},{"$f":"OFFSET(Daten_Auswahl!F14,Scrollbar,OptionButtonMultiplier)","v":1218},{"$f":"OFFSET(Daten_Auswahl!G14,Scrollbar,OptionButtonMultiplier)","v":2856},{"$f":"OFFSET(Daten_Auswahl!H14,Scrollbar,OptionButtonMultiplier)","v":6949},{"$f":"OFFSET(Daten_Auswahl!I14,Scrollbar,OptionButtonMultiplier)","v":2764},{"$f":"OFFSET(Daten_Auswahl!J14,Scrollbar,OptionButtonMultiplier)","v":9536},{"$f":"OFFSET(Daten_Auswahl!K14,Scrollbar,OptionButtonMultiplier)","v":6228}]
[null,{"$f":"OFFSET(Daten_Auswahl!B15,Scrollbar,0)","v":2023},null,{"$f":"OFFSET(Daten_Auswahl!L15,Scrollbar,OptionButtonMultiplier)","v":108266},{"$f":"OFFSET(Daten_Auswahl!C15,Scrollbar,OptionButtonMultiplier)","v":46666},{"$f":"OFFSET(Daten_Auswahl!D15,Scrollbar,OptionButtonMultiplier)","v":16804},{"$f":"OFFSET(Daten_Auswahl!E15,Scrollbar,OptionButtonMultiplier)","v":14763},{"$f":"OFFSET(Daten_Auswahl!F15,Scrollbar,OptionButtonMultiplier)","v":1364},{"$f":"OFFSET(Daten_Auswahl!G15,Scrollbar,OptionButtonMultiplier)","v":2981},{"$f":"OFFSET(Daten_Auswahl!H15,Scrollbar,OptionButtonMultiplier)","v":7195},{"$f":"OFFSET(Daten_Auswahl!I15,Scrollbar,OptionButtonMultiplier)","v":2802},{"$f":"OFFSET(Daten_Auswahl!J15,Scrollbar,OptionButtonMultiplier)","v":9822},{"$f":"OFFSET(Daten_Auswahl!K15,Scrollbar,OptionButtonMultiplier)","v":5869}]
[]
[null,"Insgesamt"]
[null,"Gewerbe und Handwerk"]
[null,"Industrie"]
[null,"Handel"]
[null,"Bank und Versicherung"]
[null,"Transport und Verkehr"]
[null,"Tourismus und Freizeitwirtschaft"]
[null,"Information und Consulting"]
[null,"Sonstige Lehrberechtigte"]
[null,"Überbetriebliche Lehrausbildung 2"]
[]
[null,"1 Abweichungen zu veröffentlichten Statistiken der Bundesländer sind in Einzelfällen aufgrund unterschiedlicher Vorgehensweisen oder Kategorisierungen möglich. "]
[null,"2 Vor 2010 nur teilweise Erfassung der Überbetrieblichen Lehrausbildung."]
[null,"3  Bevölkerungsstatistik, STATISTIK AUSTRIA (2023: Prognose)"]

{"sheet":"Daten","index":1,"n_rows":631,"n_cols":16,"rows_kept":631,"cut":false,"hidden":true,"merged":[]}
["BDL(alpha)_Jahr","Zeilenindex","BDL(alpha)","Jahr","1","2","3","4","5","6","7","8","9","10",null,"aus Tabellle Kreuztabelle Lehrlinge"]
[{"$f":"C2&D2","v":"11961"},2,1,1961,2516,79,487,null,null,83,null,null,null,3165]
["11962",3,1,1962,2758,78,608,null,null,106,null,null,null,3550]
["11963",4,1,1963,3109,102,682,null,null,147,null,null,null,4040]
["11964",5,1,1964,3369,137,712,null,null,175,null,null,null,4393]
["11965",6,1,1965,3419,139,738,null,null,177,null,null,null,4473]
["11966",7,1,1966,2663,105,537,null,null,174,null,null,null,3479]
["11967",8,1,1967,2587,87,510,null,null,140,null,null,null,3324]
["11968",9,1,1968,2577,83,534,null,null,182,null,null,null,3376]
["11969",10,1,1969,2923,101,663,null,1,174,null,null,null,3862]
["11970",11,1,1970,3157,110,656,null,1,214,null,1,null,4139]
["11971",12,1,1971,3170,120,632,0,2,257,null,1,null,4182]
["11972",13,1,1972,3211,137,686,null,3,286,null,null,null,4323]
["11973",14,1,1973,3289,177,711,1,1,327,null,null,null,4506]
["11974",15,1,1974,3322,206,737,3,1,336,null,null,null,4605]
["11975",16,1,1975,3391,224,752,5,null,372,null,null,null,4744]
["11976",17,1,1976,3406,231,772,6,1,413,null,null,null,4829]
["11977",18,1,1977,3475,290,842,6,1,440,null,null,null,5054]
["11978",19,1,1978,3529,319,841,5,2,457,null,7,null,5160]
["11979",20,1,1979,3533,332,869,2,2,495,null,7,null,5240]
["11980",21,1,1980,3494,358,859,null,2,497,null,5,null,5215]
["11981",22,1,1981,3309,344,822,0,0,477,null,5,null,4957]
["11982",23,1,1982,3058,308,793,3,1,518,null,5,null,4686]
["11983",24,1,1983,2906,241,703,4,2,506,null,5,null,4367]
["11984",25,1,1984,2822,263,707,4,2,521,null,4,null,4323]
["11985",26,1,1985,2769,258,680,2,1,527,null,5,null,4242]
["11986",27,1,1986,2756,263,669,2,null,526,null,3,null,4219]
["11987",28,1,1987,2745,263,563,3,13,525,null,25,null,4137]
["11988",29,1,1988,2695,247,575,4,12,501,null,39,null,4073]
["11989",30,1,1989,2707,248,547,3,8,453,null,52,null,4018]
["11990",31,1,1990,2743,233,551,2,7,443,null,65,null,4044]
["11991",32,1,1991,2665,225,512,3,8,376,null,67,null,3856]
["11992",33,1,1992,2535,185,475,4,10,348,null,74,null,3631]
["11993",34,1,1993,2374,177,423,5,9,313,null,69,null,3370]
["11994",35,1,1994,2365,172,404,7,7,306,null,73,null,3334]
["11995",36,1,1995,2310,158,357,8,8,289,null,74,null,3204]
["11996",37,1,1996,2254,167,315,6,8,289,null,77,null,3116]
["11997",38,1,1997,2220,184,326,3,8,283,null,138,null,3162]
["11998",39,1,1998,2189,191,326,6,5,287,null,46,147,3197]
["11999",40,1,1999,2164,204,333,7,4,294,null,85,151,3242]
["12000",41,1,2000,2127,187,321,6,4,275,null,86,113,3119]
["12001",42,1,2001,2074,182,318,3,4,271,null,80,78,3010]
["12002",43,1,2002,1892,176,313,9,5,260,40,81,63,2839]
["12003",44,1,2003,1846,171,317,9,1,267,37,79,60,2787]
["12004",45,1,2004,1852,176,329,8,3,257,40,83,62,2810]
["12005",46,1,2005,1785,184,356,7,5,284,37,127,69,2854]
["12006",47,1,2006,1755,193,375,9,3,307,35,132,147,2956]
["12007",48,1,2007,1717,200,381,8,2,301,36,134,161,2940]
["12008",49,1,2008,1692,191,380,11,2,298,40,147,160,2921]
["12009",50,1,2009,1642,189,375,11,2,299,48,158,337,3061]
["12010",51,1,2010,1528,190,368,12,5,281,42,146,467,3039]
["12011",52,1,2011,1428,203,354,19,5,251,32,125,509,2926]
["12012",53,1,2012,1319,208,358,19,3,227,32,122,510,2798]
["12013",54,1,2013,1241,219,340,19,1,198,28,125,479,2650]
["12014",55,1,2014,1192,217,349,24,1,198,26,150,533,2690]
["12015",56,1,2015,1162,199,324,24,2,197,23,191,470,2592]
["12016",57,1,2016,1128,207,333,24,2,207,22,172,497,2592]
["12017",58,1,2017,1107,215,323,27,4,195,30,178,529,2608]
["12018",59,1,2018,1161,212,318,19,5,181,22,146,457,2521]
["12019",60,1,2019,1218,246,297,30,5,173,29,162,419,2579]
["12020",61,1,2020,1194,223,310,34,6,158,23,167,452,2567]
["12021",62,1,2021,1188,237,297,30,5,140,28,159,456,2540]
["12022",63,1,2022,1235,248,307,25,3,144,24,176,385,2547]
["12023",64,1,2023,1276,265,270,26,3,151,35,179,352,2557]
[{"$f":"C65&D65","v":"21961"},65,2,1961,8095,940,2654,null,26,353,null,null,null,12068]
["21962",66,2,1962,8454,982,2908,null,28,419,null,null,null,12791]
["21963",67,2,1963,8854,1008,3171,null,26,512,null,null,null,13571]
["21964",68,2,1964,8996,1018,3191,null,24,610,null,null,null,13839]
["21965",69,2,1965,9251,1078,3218,null,28,685,null,null,null,14260]
["21966",70,2,1966,8016,859,2408,null,28,606,null,null,null,11917]
["21967",71,2,1967,7128,823,2313,null,29,584,null,null,null,10877]
["21968",72,2,1968,7164,786,2441,null,28,702,null,null,null,11121]
["21969",73,2,1969,8184,938,2978,null,38,817,null,null,null,12955]
["21970",74,2,1970,8409,1121,3034,11,46,872,null,null,null,13493]
["21971",75,2,1971,8269,1315,3071,17,58,973,null,138,null,13841]
["21972",76,2,1972,7948,1419,3235,15,61,987,null,145,null,13810]
["21973",77,2,1973,8389,1651,3401,14,65,997,null,223,null,14740]
["21974",78,2,1974,8545,1635,3541,23,72,1072,null,238,null,15126]
["21975",79,2,1975,8618,1506,3467,22,67,1190,null,275,null,15145]
["21976",80,2,1976,8539,1495,3423,26,66,1289,null,283,null,15121]
["21977",81,2,1977,8692,1353,3355,21,62,1409,null,291,null,15183]
["21978",82,2,1978,8543,1451,3366,18,52,1485,null,297,null,15212]
["21979",83,2,1979,8555,1495,3364,17,58,1552,null,331,null,15372]
["21980",84,2,1980,8479,1644,3269,20,64,1553,null,259,null,15288]
["21981",85,2,1981,8282,1701,3314,19,66,1578,null,309,null,15269]
["21982",86,2,1982,7876,1605,3176,18,55,1487,null,349,null,14566]
["21983",87,2,1983,7614,1597,3046,14,48,1511,null,294,null,14124]
["21984",88,2,1984,7568,1579,2991,18,57,1517,null,287,null,14017]
["21985",89,2,1985,7425,1594,2865,23,71,1549,null,252,null,13779]
["21986",90,2,1986,7042,1511,2823,29,73,1547,null,230,null,13255]
["21987",91,2,1987,6729,1444,2636,31,66,1570,null,222,null,12698]
["21988",92,2,1988,6462,1402,2478,29,64,1524,null,219,null,12178]
["21989",93,2,1989,6406,1313,2288,29,62,1451,null,221,null,11770]
["21990",94,2,1990,6271,1335,2133,38,63,1345,null,245,null,11430]
["21991",95,2,1991,6126,1317,1991,31,65,1264,null,241,null,11035]
["21992",96,2,1992,5967,1249,1796,30,64,1174,null,252,null,10532]
["21993",97,2,1993,5763,1117,1657,31,53,1142,null,257,null,10020]
["21994",98,2,1994,5722,1038,1629,37,33,1131,null,257,null,9847]
["21995",99,2,1995,5545,964,1519,42,25,1073,null,309,null,9477]
["21996",100,2,1996,5455,931,1416,45,25,1069,null,238,null,9179]
["21997",101,2,1997,5505,988,1379,46,32,1090,null,295,null,9335]
["21998",102,2,1998,5550,1095,1430,56,28,1199,null,299,51,9708]
["21999",103,2,1999,5481,1086,1503,57,25,1165,null,340,108,9765]
["22000",104,2,2000,5351,1087,1574,34,25,1147,null,329,139,9686]
["22001",105,2,2001,5169,1094,1554,35,31,1145,null,337,156,9521]
["22002",106,2,2002,4807,1038,1502,40,27,1135,182,312,139,9182]
["22003",107,2,2003,4429,1062,1397,45,28,1121,180,330,122,8714]
["22004",108,2,2004,4354,1055,1371,48,29,1117,168,399,119,8660]
["22005",109,2,2005,4370,1067,1460,55,28,1211,186,506,121,9004]
["22006",110,2,2006,4547,1055,1491,68,43,1245,190,473,172,9284]
["22007",111,2,2007,4667,1102,1550,87,49,1280,175,464,206,9580]
["22008",112,2,2008,4716,1158,1596,90,85,1202,178,455,253,9733]
["22009",113,2,2009,4506,1071,1461,78,75,1159,155,507,415,9427]
["22010",114,2,2010,4283,1063,1492,83,70,1033,163,526,457,9170]
["22011",115,2,2011,4130,1039,1491,79,67,1045,154,511,451,8967]
["22012",116,2,2012,4055,990,1536,81,62,980,161,489,444,8798]
["22013",117,2,2013,3827,977,1465,87,62,922,142,453,460,8395]
["22014",118,2,2014,3593,989,1386,88,49,848,117,423,465,7958]
["22015",119,2,2015,3364,921,1299,73,45,799,122,421,457,7501]
["22016",120,2,2016,3167,890,1222,59,53,736,101,391,516,7135]
["22017",121,2,2017,3148,882,1193,58,52,782,119,397,459,7090]
["22018",122,2,2018,3196,925,1180,56,58,810,136,387,373,7121]
["22019",123,2,2019,3272,969,1154,58,66,785,142,433,286,7165]
["22020",124,2,2020,3306,984,1194,67,68,697,146,472,298,7232]
["22021",125,2,2021,3412,978,1222,71,56,593,138,536,184,7190]
["22022",126,2,2022,3507,1000,1144,72,67,588,153,588,212,7331]
["22023",127,2,2023,3610,1034,1067,79,80,579,146,590,177,7362]
[{"$f":"C128&D128","v":"31961"},128,3,1961,16037,2771,4013,null,50,616,null,null,null,23487]
["31962",129,3,1962,16230,2925,4573,null,60,782,null,null,null,24570]
["31963",130,3,1963,17099,2869,4946,null,53,958,null,null,null,25925]
["31964",131,3,1964,17540,2826,4871,null,51,1077,null,null,null,26365]
["31965",132,3,1965,17352,2786,4950,null,53,1128,null,null,null,26269]
["31966",133,3,1966,12875,2035,3647,null,48,989,null,null,null,19594]
["31967",134,3,1967,12418,1911,3421,null,65,909,null,null,null,18724]
["31968",135,3,1968,12473,1740,3383,null,80,983,null,null,null,18659]
["31969",136,3,1969,14594,2235,4487,null,81,1185,null,null,null,22582]
["31970",137,3,1970,15919,2388,4310,null,220,1291,null,131,null,24259]
["31971",138,3,1971,15692,2801,4515,null,206,1365,null,135,null,24714]
["31972",139,3,1972,15321,2995,4800,null,216,1491,null,152,null,24975]
["31973",140,3,1973,15420,3288,4942,null,225,1581,null,162,null,25618]
["31974",141,3,1974,16046,3604,5229,10,219,1674,null,153,null,26935]
["31975",142,3,1975,16686,3610,5408,10,213,1925,null,150,null,28002]
["31976",143,3,1976,17308,3619,5754,13,213,2160,null,148,null,29215]
["31977",144,3,1977,17864,3651,6016,11,207,2671,null,158,null,30578]
["31978",145,3,1978,18445,3693,6077,15,221,2671,null,188,null,31310]
["31979",146,3,1979,18587,3813,6034,15,223,2760,null,178,null,31610]
["31980",147,3,1980,18514,3932,5826,13,207,2768,null,168,null,31428]
["31981",148,3,1981,17837,3924,5252,9,171,2829,null,166,null,30188]
["31982",149,3,1982,16905,3802,4926,9,203,2848,null,151,null,28844]
["31983",150,3,1983,15919,3582,4671,7,168,2874,null,240,null,27461]
["31984",151,3,1984,15463,3603,4660,8,68,2916,null,382,null,27100]
["31985",152,3,1985,15133,3372,4650,4,69,2940,null,579,null,26747]
["31986",153,3,1986,14675,3288,4457,9,68,2799,null,634,null,25930]
["31987",154,3,1987,14228,3157,4256,11,62,2730,null,580,null,25024]
["31988",155,3,1988,13717,2888,4121,12,73,2636,null,547,null,23994]
["31989",156,3,1989,13617,2832,4148,8,81,2474,null,489,null,23649]
["31990",157,3,1990,13632,2803,4009,9,91,2366,null,469,null,23379]
["31991",158,3,1991,13458,2737,3811,9,114,2214,null,455,null,22798]
["31992",159,3,1992,13250,2638,3535,13,114,1991,null,409,null,21950]
["31993",160,3,1993,13194,2330,3382,14,108,1840,null,377,null,21245]
["31994",161,3,1994,12898,2101,3231,10,70,1696,null,383,null,20389]
["31995",162,3,1995,12875,1950,2956,8,66,1612,null,365,null,19832]
["31996",163,3,1996,12756,1849,2796,3,58,1614,null,384,null,19460]
["31997",164,3,1997,12731,1919,2793,3,163,1735,null,346,null,19690]
["31998",165,3,1998,12531,2077,2848,43,173,1885,null,418,515,20490]
["31999",166,3,1999,12260,2081,2810,55,220,1962,null,510,630,20528]
["32000",167,3,2000,11900,2122,2933,59,203,1984,null,480,502,20183]
["32001",168,3,2001,11534,2167,2943,45,207,1875,null,433,381,19585]
["32002",169,3,2002,10620,2114,2804,55,190,1836,329,424,301,18673]
["32003",170,3,2003,10105,2166,2649,64,191,1857,307,474,310,18123]
["32004",171,3,2004,10022,2181,2597,68,179,1893,288,528,300,18056]
["32005",172,3,2005,9980,2257,2595,72,177,1991,287,748,370,18477]
["32006",173,3,2006,10155,2327,2755,77,177,2074,318,704,484,19071]
["32007",174,3,2007,10426,2494,2944,78,205,2079,334,722,500,19782]
["32008",175,3,2008,10462,2698,2946,77,235,2020,327,738,467,19970]
["32009",176,3,2009,9999,2580,2822,93,252,1811,301,806,1297,19961]
["32010",177,3,2010,9520,2556,2789,101,275,1681,283,794,1815,19814]
["32011",178,3,2011,9286,2487,2829,129,317,1555,290,801,1713,19407]
["32012",179,3,2012,9067,2468,2800,123,419,1423,271,776,1824,19171]
["32013",180,3,2013,8684,2528,2699,120,450,1306,291,805,1755,18638]
["32014",181,3,2014,8172,2446,2489,106,461,1172,282,795,1770,17693]
["32015",182,3,2015,7632,2346,2406,98,462,1065,264,791,1769,16833]
["32016",183,3,2016,7388,2241,2287,96,505,1014,244,845,1423,16043]
["32017",184,3,2017,7280,2278,2265,91,545,1061,255,815,1231,15821]
["32018",185,3,2018,7513,2433,2275,99,538,1068,286,800,1142,16154]
["32019",186,3,2019,7841,2601,2414,94,542,1109,289,860,1061,16811]
["32020",187,3,2020,8011,2623,2409,106,533,995,279,981,1006,16943]
["32021",188,3,2021,8205,2594,2499,108,519,917,242,1108,918,17110]
["32022",189,3,2022,8291,2643,2588,126,520,923,265,1267,789,17412]
["32023",190,3,2023,8263,2668,2505,138,485,909,267,1417,659,17311]
[{"$f":"C191&D191","v":"41961"},191,4,1961,13227,3722,4796,null,121,415,null,null,null,22281]
["41962",192,4,1962,13828,3895,5099,null,132,453,null,null,null,23407]
["41963",193,4,1963,14385,3858,5495,null,129,483,null,null,null,24350]
["41964",194,4,1964,14481,3766,5478,null,125,565,null,null,null,24415]
["41965",195,4,1965,14495,3701,5450,null,134,581,null,null,null,24361]
["41966",196,4,1966,10875,3011,4058,null,114,489,null,null,null,18547]
["41967",197,4,1967,11107,3002,3992,null,112,514,null,null,null,18727]
["41968",198,4,1968,11131,3182,4128,null,124,561,null,null,null,19126]
["41969",199,4,1969,13038,3653,5304,null,335,730,null,null,null,23060]
["41970",200,4,1970,13874,4265,5402,3,395,769,null,91,null,24799]
["41971",201,4,1971,13825,4720,5777,6,406,856,null,145,null,25735]
["41972",202,4,1972,14084,5176,6168,47,438,866,null,196,null,26975]
["41973",203,4,1973,14866,5778,6352,148,450,930,null,239,null,28763]
["41974",204,4,1974,15586,6232,6496,202,457,1061,null,240,null,30274]
["41975",205,4,1975,16412,6534,6753,213,468,1194,null,245,null,31819]
["41976",206,4,1976,17131,6654,6822,188,476,1344,null,242,null,32857]
["41977",207,4,1977,17936,6810,7175,153,511,1537,null,256,null,34378]
["41978",208,4,1978,18574,6749,7294,124,507,1653,null,307,null,35208]
["41979",209,4,1979,18777,6693,7219,111,495,1659,null,345,null,35299]
["41980",210,4,1980,18767,6758,7232,143,497,1739,null,378,null,35514]
["41981",211,4,1981,18148,6743,6915,131,500,1845,null,380,null,34662]
["41982",212,4,1982,17227,6803,6638,152,505,1844,null,381,null,33550]
["41983",213,4,1983,16589,6676,6155,136,503,1868,null,417,null,32344]
["41984",214,4,1984,15797,6471,6028,132,515,1964,null,439,null,31346]
["41985",215,4,1985,15419,6340,5981,124,521,2060,null,444,null,30889]
["41986",216,4,1986,14957,6154,5704,129,506,1992,null,510,null,29952]
["41987",217,4,1987,14738,5927,5530,126,497,2110,null,576,null,29504]
["41988",218,4,1988,14868,5615,5443,141,506,2081,null,654,null,29308]
["41989",219,4,1989,14599,5432,5343,142,501,1985,null,638,null,28640]
["41990",220,4,1990,14111,5509,5036,167,494,1834,null,642,null,27793]
["41991",221,4,1991,13706,5419,4982,187,506,1640,null,670,null,27110]
["41992",222,4,1992,13475,5014,4708,191,498,1501,null,717,null,26104]
["41993",223,4,1993,13725,4701,4490,178,455,1470,null,504,null,25523]
["41994",224,4,1994,13619,4230,4251,173,427,1514,null,547,null,24761]
["41995",225,4,1995,13534,3852,4081,157,402,1512,null,554,null,24092]
["41996",226,4,1996,13575,3573,3745,147,221,1543,null,729,null,23533]
["41997",227,4,1997,13995,3708,3887,134,241,1652,null,1167,null,24784]
["41998",228,4,1998,14228,3901,4059,146,448,1820,null,1120,null,25722]
["41999",229,4,1999,14374,3894,4294,165,507,2021,null,1407,null,26662]
["42000",230,4,2000,14015,3950,4175,185,525,1923,null,1420,662,26855]
["42001",231,4,2001,13675,4115,4220,192,545,1866,null,1247,312,26172]
["42002",232,4,2002,12676,4312,4058,194,531,1825,582,1292,107,25577]
["42003",233,4,2003,12466,4475,3984,182,496,1972,586,1303,221,25685]
["42004",234,4,2004,12376,4518,3868,197,506,1975,533,1375,272,25620]
["42005",235,4,2005,12825,4458,4003,205,541,2198,517,1568,205,26520]
["42006",236,4,2006,12887,4471,4106,225,531,2097,545,1628,236,26726]
["42007",237,4,2007,13338,4718,4118,236,581,2112,584,1726,278,27691]
["42008",238,4,2008,13321,5083,4191,249,634,2134,584,1642,328,28166]
["42009",239,4,2009,13220,5041,4033,235,641,2043,524,1816,456,28009]
["42010",240,4,2010,12674,4878,3887,229,655,1917,519,1827,1005,27591]
["42011",241,4,2011,12421,4797,3917,236,671,1833,496,1836,1154,27361]
["42012",242,4,2012,11975,4698,3868,259,667,1755,504,1750,1227,26703]
["42013",243,4,2013,11406,4734,3619,250,657,1580,491,1681,1278,25696]
["42014",244,4,2014,10813,4780,3322,239,382,1419,447,1919,1323,24644]
["42015",245,4,2015,10152,4769,3137,233,533,1352,429,1724,1331,23660]
["42016",246,4,2016,9851,4712,2939,221,534,1360,418,1684,1267,22986]
["42017",247,4,2017,9675,4736,2943,230,533,1331,412,1645,1274,22779]
["42018",248,4,2018,9870,4854,2967,239,548,1353,441,1655,1233,23160]
["42019",249,4,2019,9869,5110,2985,257,573,1280,487,1717,1016,23294]
["42020",250,4,2020,9804,5046,2893,265,547,1109,508,1843,846,22861]
["42021",251,4,2021,9775,5056,2819,241,564,946,514,1892,638,22445]
["42022",252,4,2022,9805,5183,2862,251,592,1014,589,1910,472,22678]
["42023",253,4,2023,9645,5331,2785,279,621,1003,603,1905,349,22521]
[{"$f":"C254&D254","v":"51961"},254,5,1961,4994,832,1880,null,77,362,null,null,null,8145]
["51962",255,5,1962,5126,838,1971,null,98,421,null,null,null,8454]
["51963",256,5,1963,5254,903,2057,null,112,531,null,null,null,8857]
["51964",257,5,1964,5175,918,2072,null,122,601,null,null,null,8888]
["51965",258,5,1965,5096,950,2086,null,120,629,null,null,null,8881]
["51966",259,5,1966,3947,762,1534,null,97,529,null,null,null,6869]
["51967",260,5,1967,3975,745,1474,null,89,507,null,null,null,6790]
["51968",261,5,1968,3926,765,1478,null,94,532,null,null,null,6795]
["51969",262,5,1969,4530,866,1952,null,105,676,null,null,null,8129]
["51970",263,5,1970,4804,833,1966,1,218,720,null,101,null,8643]
["51971",264,5,1971,4938,917,2101,5,221,836,null,95,null,9113]
["51972",265,5,1972,5000,982,2255,20,152,937,null,203,null,9549]
["51973",266,5,1973,5293,1019,2339,34,278,1083,null,121,null,10167]
["51974",267,5,1974,5427,1148,2412,48,266,1101,null,122,null,10524]
["51975",268,5,1975,5638,1177,2607,47,280,1102,null,125,null,10976]
["51976",269,5,1976,5911,1271,2832,39,262,1252,null,128,null,11695]
["51977",270,5,1977,6296,1312,3028,31,272,1443,null,121,null,12503]
["51978",271,5,1978,6756,1342,3184,31,286,1610,null,120,null,13329]
["51979",272,5,1979,7062,1357,3174,29,278,1686,null,136,null,13722]
["51980",273,5,1980,7144,1332,3111,30,298,1727,null,177,null,13819]
["51981",274,5,1981,7124,1351,3058,23,307,1732,null,193,null,13788]
["51982",275,5,1982,6997,1292,2997,21,289,1765,null,228,null,13589]
["51983",276,5,1983,6858,1261,2923,20,299,1850,null,240,null,13451]
["51984",277,5,1984,6800,1271,2913,18,278,1922,null,265,null,13467]
["51985",278,5,1985,6562,1274,2920,17,280,1906,null,293,null,13252]
["51986",279,5,1986,6336,1262,2804,17,273,1822,null,283,null,12797]
["51987",280,5,1987,6033,1224,2651,31,265,1794,null,275,null,12273]
["51988",281,5,1988,5804,1196,2466,46,288,1626,null,277,null,11703]
["51989",282,5,1989,5480,1172,2307,54,294,1534,null,265,null,11106]
["51990",283,5,1990,5404,1206,2177,59,311,1410,null,247,null,10814]
["51991",284,5,1991,5397,1219,2018,65,321,1310,null,258,null,10588]
["51992",285,5,1992,5415,1235,1871,60,345,1270,null,226,null,10422]
["51993",286,5,1993,5460,1127,1869,70,328,1253,null,222,null,10329]
["51994",287,5,1994,5534,991,1948,74,291,1316,null,215,null,10369]
["51995",288,5,1995,5438,844,1885,80,262,1357,null,228,null,10094]
["51996",289,5,1996,5414,745,1821,77,219,1395,null,212,null,9883]
["51997",290,5,1997,5272,748,1741,71,219,1434,null,319,null,9804]
["51998",291,5,1998,5224,725,1739,68,201,1504,null,387,null,9848]
["51999",292,5,1999,5222,659,1726,84,224,1579,null,431,75,10000]
["52000",293,5,2000,5201,677,1741,93,204,1577,null,417,93,10003]
["52001",294,5,2001,5164,697,1761,101,202,1539,null,389,53,9906]
["52002",295,5,2002,4790,736,1698,93,184,1521,269,388,25,9704]
["52003",296,5,2003,4782,741,1665,91,150,1515,249,399,8,9600]
["52004",297,5,2004,4785,706,1644,88,135,1542,250,395,null,9545]
["52005",298,5,2005,4862,705,1663,98,147,1611,243,448,null,9777]
["52006",299,5,2006,5073,723,1757,109,161,1715,275,579,null,10392]
["52007",300,5,2007,5101,791,1837,126,173,1767,298,589,null,10682]
["52008",301,5,2008,5214,850,1734,132,191,1713,308,527,119,10788]
["52009",302,5,2009,5166,804,1712,128,177,1588,285,558,132,10550]
["52010",303,5,2010,5019,784,1691,120,192,1483,259,581,179,10308]
["52011",304,5,2011,4866,810,1705,119,177,1340,283,583,179,10062]
["52012",305,5,2012,4663,815,1623,129,183,1307,280,605,182,9787]
["52013",306,5,2013,4420,779,1652,131,170,1215,264,591,174,9396]
["52014",307,5,2014,4290,752,1523,121,157,1129,245,593,98,8908]
["52015",308,5,2015,4068,701,1390,120,166,1101,230,594,97,8467]
["52016",309,5,2016,3916,674,1312,134,176,1078,221,607,114,8232]
["52017",310,5,2017,3895,677,1280,134,185,1122,221,604,154,8272]
["52018",311,5,2018,3984,702,1312,127,203,1082,237,616,159,8422]
["52019",312,5,2019,3922,714,1362,153,202,1073,243,649,136,8454]
["52020",313,5,2020,3991,714,1337,139,197,913,245,687,121,8344]
["52021",314,5,2021,3959,695,1283,131,201,768,266,725,121,8149]
["52022",315,5,2022,3854,658,1242,123,213,707,250,822,112,7981]
["52023",316,5,2023,3807,635,1247,138,235,712,265,837,113,7989]
[{"$f":"C317&D317","v":"61961"},317,6,1961,14915,3460,5418,null,68,850,null,null,null,24711]
["61962",318,6,1962,15203,3638,5810,null,84,938,null,null,null,25673]
["61963",319,6,1963,15472,3735,6121,null,92,1063,null,null,null,26483]
["61964",320,6,1964,15991,3773,6136,null,83,1247,null,null,null,27230]
["61965",321,6,1965,15863,4051,6223,null,76,1412,null,null,null,27625]
["61966",322,6,1966,12842,3501,4783,null,63,1202,null,null,null,22391]
["61967",323,6,1967,12360,3352,4545,null,76,1326,null,null,null,21659]
["61968",324,6,1968,12386,3207,4600,null,77,1391,null,null,null,21661]
["61969",325,6,1969,14109,3444,5857,null,238,1671,null,null,null,25319]
["61970",326,6,1970,14936,3595,6165,null,101,1911,null,514,null,27222]
["61971",327,6,1971,16081,3819,6492,10,333,2010,null,514,null,29259]
["61972",328,6,1972,15791,4682,6918,20,353,2283,null,531,null,30578]
["61973",329,6,1973,16094,5229,7254,29,391,2448,null,532,null,31977]
["61974",330,6,1974,16540,5114,7437,30,405,2331,null,638,null,32495]
["61975",331,6,1975,16767,5150,7183,29,415,2633,null,735,null,32912]
["61976",332,6,1976,16828,5455,7021,30,397,2830,null,644,null,33205]
["61977",333,6,1977,17382,5476,7101,26,405,3072,null,655,null,34117]
["61978",334,6,1978,17868,5603,7449,41,414,3366,null,723,null,35464]
["61979",335,6,1979,18326,5633,6938,44,399,3412,null,749,null,35501]
["61980",336,6,1980,17840,5749,7214,47,387,3837,null,532,null,35606]
["61981",337,6,1981,16971,5425,6737,37,320,3568,null,607,null,33665]
["61982",338,6,1982,16059,5258,6286,32,375,3611,null,791,null,32412]
["61983",339,6,1983,14807,5125,5763,39,377,3648,null,891,null,30650]
["61984",340,6,1984,13888,5057,5575,47,373,3643,null,1050,null,29633]
["61985",341,6,1985,13490,5084,5467,36,370,3671,null,1100,null,29218]
["61986",342,6,1986,13313,5012,5458,48,356,3670,null,1044,null,28901]
["61987",343,6,1987,12950,4711,5096,44,355,3515,null,960,null,27631]
["61988",344,6,1988,12726,4535,4657,43,343,3458,null,893,null,26655]
["61989",345,6,1989,12608,4309,4254,33,337,3206,null,903,null,25650]
["61990",346,6,1990,12660,4310,4192,45,355,2988,null,813,null,25363]
["61991",347,6,1991,12520,4135,4076,47,373,2676,null,855,null,24682]
["61992",348,6,1992,12473,3750,3765,56,377,2438,null,841,null,23700]
["61993",349,6,1993,12154,3238,3448,54,352,2315,null,835,null,22396]
["61994",350,6,1994,11768,2874,3199,53,333,2228,null,914,null,21369]
["61995",351,6,1995,11282,2673,2919,62,261,2242,null,919,null,20358]
["61996",352,6,1996,11121,2560,2825,58,192,2259,null,784,null,19799]
["61997",353,6,1997,11139,2574,2723,67,155,2307,null,912,null,19877]
["61998",354,6,1998,11107,2548,2699,71,242,2342,null,810,72,19891]
["61999",355,6,1999,10926,2511,2637,84,285,2322,null,942,537,20244]
["62000",356,6,2000,10719,2676,2777,76,272,2264,null,976,412,20172]
["62001",357,6,2001,10351,2722,2731,88,284,2194,null,894,186,19450]
["62002",358,6,2002,9640,2731,2605,89,252,2138,341,784,116,18696]
["62003",359,6,2003,9240,2773,2508,80,258,2138,325,809,93,18224]
["62004",360,6,2004,9080,2785,2569,81,228,2142,318,906,235,18344]
["62005",361,6,2005,9101,2850,2530,83,146,2145,287,1239,362,18743]
["62006",362,6,2006,9271,2800,2487,92,157,2178,289,1206,684,19164]
["62007",363,6,2007,9258,2980,2619,104,161,2156,331,1344,729,19682]
["62008",364,6,2008,9296,3200,2599,99,167,2103,348,1358,734,19904]
["62009",365,6,2009,8743,3073,2457,109,162,1939,312,1494,1549,19838]
["62010",366,6,2010,8411,3000,2414,102,168,1755,294,1449,1705,19298]
["62011",367,6,2011,8279,3056,2481,106,184,1598,311,1367,1529,18911]
["62012",368,6,2012,8085,2967,2477,108,170,1536,297,1249,1375,18264]
["62013",369,6,2013,7788,3033,2396,108,154,1366,270,1205,1260,17580]
["62014",370,6,2014,7378,2940,2248,107,133,1281,254,1145,1251,16737]
["62015",371,6,2015,6924,2751,2119,111,134,1211,226,1126,1218,15820]
["62016",372,6,2016,6676,2643,2090,105,156,1134,218,1158,1146,15326]
["62017",373,6,2017,6608,2641,2086,96,176,1158,246,1237,1081,15329]
["62018",374,6,2018,6794,2814,2084,97,184,1175,270,1230,955,15603]
["62019",375,6,2019,6811,2909,2067,105,192,1108,306,1216,829,15543]
["62020",376,6,2020,6907,2856,1999,115,171,981,324,1242,728,15323]
["62021",377,6,2021,6983,2779,2008,104,172,884,356,1327,715,15328]
["62022",378,6,2022,7008,2766,1997,96,175,835,389,1358,651,15275]
["62023",379,6,2023,6913,2893,1965,125,176,853,373,1384,636,15318]
[{"$f":"C380&D380","v":"71961"},380,7,1961,5780,901,2360,null,74,528,null,null,null,9643]
["71962",381,7,1962,5983,939,2439,null,78,606,null,null,null,10045]
["71963",382,7,1963,6278,946,2559,null,76,693,null,null,null,10552]
["71964",383,7,1964,6430,881,2492,null,78,761,null,null,null,10642]
["71965",384,7,1965,6163,847,2568,null,83,790,null,null,null,10451]
["71966",385,7,1966,4800,675,1894,null,63,676,null,null,null,8108]
["71967",386,7,1967,4682,677,1721,null,70,614,null,null,null,7764]
["71968",387,7,1968,4750,700,1697,null,69,673,null,null,null,7889]
["71969",388,7,1969,5400,821,2178,null,82,829,null,null,null,9310]
["71970",389,7,1970,5637,964,2406,6,170,871,null,63,null,10117]
["71971",390,7,1971,5746,1048,2515,14,161,940,null,58,null,10482]
["71972",391,7,1972,6033,1100,2737,23,179,1011,null,58,null,11141]
["71973",392,7,1973,6518,1084,2936,36,181,1088,null,52,null,11895]
["71974",393,7,1974,6971,1197,3094,41,201,1097,null,65,null,12666]
["71975",394,7,1975,7290,1237,3265,41,195,1235,null,62,null,13325]
["71976",395,7,1976,7681,1247,3535,32,191,1402,null,75,null,14163]
["71977",396,7,1977,8055,1313,3841,32,197,1558,null,77,null,15073]
["71978",397,7,1978,8504,1404,4035,34,203,1835,null,72,null,16087]
["71979",398,7,1979,8850,1475,4015,30,202,1961,null,104,null,16637]
["71980",399,7,1980,9166,1624,4067,37,197,1885,null,118,null,17094]
["71981",400,7,1981,9156,1556,3925,31,202,1855,null,136,null,16861]
["71982",401,7,1982,8902,1437,3861,32,186,2150,null,122,null,16690]
["71983",402,7,1983,8640,1423,3733,29,186,2293,null,157,null,16461]
["71984",403,7,1984,8431,1434,3692,34,182,2504,null,164,null,16441]
["71985",404,7,1985,8313,1460,3641,34,188,2458,null,185,null,16279]
["71986",405,7,1986,8133,1508,3424,37,196,2281,null,173,null,15752]
["71987",406,7,1987,7816,1468,3249,37,190,2181,null,169,null,15110]
["71988",407,7,1988,7441,1423,3017,39,184,2049,null,159,null,14312]
["71989",408,7,1989,7320,1401,2797,38,189,1832,null,161,null,13738]
["71990",409,7,1990,7167,1413,2604,40,188,1547,null,157,null,13116]
["71991",410,7,1991,6904,1390,2395,37,191,1412,null,158,null,12487]
["71992",411,7,1992,6814,1388,2293,32,196,1322,null,155,null,12200]
["71993",412,7,1993,6732,1258,2173,33,194,1354,null,160,null,11904]
["71994",413,7,1994,6663,1133,2115,36,173,1413,null,211,null,11744]
["71995",414,7,1995,6597,1070,1978,38,141,1406,null,282,null,11512]
["71996",415,7,1996,6515,1050,1865,43,122,1546,null,213,null,11354]
["71997",416,7,1997,6617,1048,1851,41,122,1688,null,258,null,11625]
["71998",417,7,1998,6582,1103,1846,48,112,1913,null,311,31,11946]
["71999",418,7,1999,6688,1096,1888,51,133,2023,null,389,44,12312]
["72000",419,7,2000,6789,1142,1947,59,147,1911,null,370,12,12377]
["72001",420,7,2001,6835,1229,1999,59,166,1866,null,373,1,12528]
["72002",421,7,2002,6434,1299,2005,65,150,1979,275,367,null,12574]
["72003",422,7,2003,6323,1326,2027,65,146,2144,239,384,null,12654]
["72004",423,7,2004,6409,1289,2065,64,163,2334,232,386,null,12942]
["72005",424,7,2005,6509,1254,2194,73,103,2408,194,496,55,13286]
["72006",425,7,2006,6666,1256,2223,75,113,2432,205,501,114,13585]
["72007",426,7,2007,6933,1298,2350,82,124,2339,229,581,103,14039]
["72008",427,7,2008,6945,1336,2306,78,145,2200,256,604,60,13930]
["72009",428,7,2009,6754,1280,2252,95,169,2028,252,608,416,13854]
["72010",429,7,2010,6488,1258,2214,97,188,1863,252,616,383,13359]
["72011",430,7,2011,6326,1239,2206,105,197,1695,247,623,299,12937]
["72012",431,7,2012,6164,1234,2184,98,200,1581,240,635,189,12525]
["72013",432,7,2013,5935,1227,2054,107,206,1427,235,661,232,12084]
["72014",433,7,2014,5624,1244,1894,105,210,1314,229,648,222,11490]
["72015",434,7,2015,5364,1229,1782,100,217,1215,209,609,222,10947]
["72016",435,7,2016,5281,1224,1678,87,235,1188,192,648,175,10708]
["72017",436,7,2017,5293,1295,1659,85,256,1142,186,669,140,10725]
["72018",437,7,2018,5414,1321,1615,78,267,1173,205,681,117,10871]
["72019",438,7,2019,5450,1333,1595,89,263,1157,229,666,92,10874]
["72020",439,7,2020,5420,1325,1531,97,246,1075,230,663,79,10666]
["72021",440,7,2021,5455,1288,1549,95,235,978,211,682,76,10569]
["72022",441,7,2022,5341,1272,1507,91,258,913,224,738,64,10408]
[{"$f":"C442&D442","v":"72023"},442,7,2023,5205,1274,1411,110,274,928,211,778,67,10258]
["81961",443,8,1961,2203,482,712,null,25,210,null,null,null,3632]
["81962",444,8,1962,2316,506,782,null,31,227,null,null,null,3862]
["81963",445,8,1963,2506,574,832,null,40,247,null,null,null,4199]
["81964",446,8,1964,2596,606,864,null,36,282,null,null,null,4384]
["81965",447,8,1965,2664,598,861,null,41,284,null,null,null,4448]
["81966",448,8,1966,2095,476,667,null,34,266,null,null,null,3538]
["81967",449,8,1967,2130,438,611,null,43,277,null,null,null,3499]
["81968",450,8,1968,2129,455,644,null,37,275,null,null,null,3540]
["81969",451,8,1969,2359,505,828,null,98,300,null,null,null,4090]
["81970",452,8,1970,2448,605,975,5,61,312,null,124,null,4530]
["81971",453,8,1971,2489,729,996,11,117,326,null,84,null,4752]
["81972",454,8,1972,2636,817,1068,24,120,317,null,99,null,5081]
["81973",455,8,1973,2872,1008,1180,39,139,329,null,115,null,5682]
["81974",456,8,1974,3023,1102,1374,47,151,358,null,122,null,6177]
["81975",457,8,1975,3343,1114,1507,42,132,475,null,124,null,6737]
["81976",458,8,1976,3538,1082,1652,34,122,599,null,115,null,7142]
["81977",459,8,1977,3779,1115,1773,41,116,657,null,103,null,7584]
["81978",460,8,1978,4171,1129,1917,41,127,750,null,126,null,8261]
["81979",461,8,1979,4450,1275,1922,43,115,748,null,120,null,8673]
["81980",462,8,1980,4577,1447,2029,45,115,696,null,136,null,9045]
["81981",463,8,1981,4474,1484,1933,43,107,641,null,132,null,8814]
["81982",464,8,1982,4321,1449,1894,40,106,664,null,131,null,8605]
["81983",465,8,1983,4314,1406,1870,33,97,772,null,133,null,8625]
["81984",466,8,1984,4208,1343,1843,32,102,849,null,140,null,8517]
["81985",467,8,1985,4156,1373,1870,35,112,832,null,142,null,8520]
["81986",468,8,1986,3985,1401,1851,31,114,732,null,140,null,8254]
["81987",469,8,1987,3912,1393,1846,34,118,703,null,146,null,8152]
["81988",470,8,1988,3836,1449,1770,27,115,666,null,146,null,8009]
["81989",471,8,1989,3835,1463,1653,30,123,564,null,151,null,7819]
["81990",472,8,1990,3869,1453,1562,33,134,511,null,160,null,7722]
["81991",473,8,1991,3914,1404,1504,41,130,473,null,161,null,7627]
["81992",474,8,1992,3970,1289,1470,47,128,408,null,154,null,7466]
["81993",475,8,1993,4027,1114,1370,40,119,551,null,151,null,7372]
["81994",476,8,1994,3952,1025,1293,37,120,596,null,174,null,7197]
["81995",477,8,1995,3926,956,1200,31,113,611,null,236,null,7073]
["81996",478,8,1996,3834,902,1178,35,109,610,null,202,null,6870]
["81997",479,8,1997,3850,939,1169,32,105,647,null,230,null,6972]
["81998",480,8,1998,3720,1012,1155,35,102,710,null,260,13,7007]
["81999",481,8,1999,3599,1045,1166,38,118,700,null,294,3,6963]
["82000",482,8,2000,3663,1064,1229,46,123,678,null,300,3,7106]
["82001",483,8,2001,3683,1126,1208,58,126,707,null,316,null,7224]
["82002",484,8,2002,3422,1180,1174,68,127,685,226,319,null,7201]
["82003",485,8,2003,3427,1222,1083,63,126,744,229,316,null,7210]
["82004",486,8,2004,3488,1246,1102,62,139,769,204,312,null,7322]
["82005",487,8,2005,3572,1183,1103,68,134,855,191,341,68,7515]
["82006",488,8,2006,3716,1184,1123,79,103,895,190,439,91,7820]
["82007",489,8,2007,3786,1217,1165,79,110,906,174,447,117,8001]
["82008",490,8,2008,3853,1305,1145,82,105,894,191,481,119,8175]
["82009",491,8,2009,3758,1347,1166,84,101,865,191,490,145,8147]
["82010",492,8,2010,3672,1383,1153,90,107,836,199,537,156,8133]
["82011",493,8,2011,3701,1428,1207,97,109,789,203,560,146,8240]
["82012",494,8,2012,3628,1443,1202,108,104,758,175,542,144,8104]
["82013",495,8,2013,3558,1480,1125,102,111,692,185,505,156,7914]
["82014",496,8,2014,3427,1512,1005,98,162,624,175,401,138,7542]
["82015",497,8,2015,3286,1507,936,80,164,565,165,381,141,7225]
["82016",498,8,2016,3215,1494,857,85,186,535,170,382,172,7096]
["82017",499,8,2017,3268,1537,847,85,195,511,156,356,188,7143]
["82018",500,8,2018,3269,1593,856,87,193,509,165,340,152,7164]
["82019",501,8,2019,3319,1616,849,90,202,525,155,327,155,7238]
["82020",502,8,2020,3231,1606,833,79,212,528,152,319,155,7115]
["82021",503,8,2021,3136,1582,827,73,221,462,140,329,138,6908]
["82022",504,8,2022,3044,1560,808,83,212,446,138,334,131,6756]
[{"$f":"C505&D505","v":"82023"},505,8,2023,2990,1523,796,88,224,479,134,333,168,6735]
["91961",506,9,1961,19811,7539,7993,null,302,971,null,null,null,36616]
["91962",507,9,1962,18840,7532,8069,null,341,1073,null,null,null,35855]
["91963",508,9,1963,18793,7606,8385,null,356,1173,null,null,null,36313]
["91964",509,9,1964,17411,7294,7603,null,338,1123,null,null,null,33769]
["91965",510,9,1965,14974,6717,6433,null,299,1105,null,null,null,29528]
["91966",511,9,1966,10163,5094,4178,null,227,798,null,null,null,20460]
["91967",512,9,1967,8902,4904,3313,null,195,807,null,null,null,18121]
["91968",513,9,1968,8219,4677,3004,null,217,796,null,null,null,16913]
["91969",514,9,1969,9237,4881,3903,null,420,903,null,null,null,19344]
["91970",515,9,1970,9486,5017,3797,null,544,912,null,487,null,20243]
["91971",516,9,1971,9079,5272,3824,30,605,931,null,465,null,20206]
["91972",517,9,1972,9086,5488,3779,120,708,981,null,501,null,20663]
["91973",518,9,1973,9339,5947,4135,273,835,1071,null,908,null,22508]
["91974",519,9,1974,9934,6274,4612,340,939,1097,null,1553,null,24749]
["91975",520,9,1975,10783,6292,5284,295,1000,1193,null,1665,null,26512]
["91976",521,9,1976,11556,6271,6106,275,1072,1324,null,1688,null,28292]
["91977",522,9,1977,12336,6054,6584,203,1136,1356,null,1520,null,29189]
["91978",523,9,1978,13383,5982,6757,213,1160,1422,null,1420,null,30337]
["91979",524,9,1979,13893,5942,6991,191,1201,1515,null,1365,null,31098]
["91980",525,9,1980,14070,5824,6929,189,1234,1530,null,1304,null,31080]
["91981",526,9,1981,13740,5523,6497,184,1205,1556,null,1281,null,29986]
["91982",527,9,1982,13099,5213,6099,225,1221,1609,null,1370,null,28836]
["91983",528,9,1983,12857,4877,5944,234,1185,1661,null,1476,null,28234]
["91984",529,9,1984,12598,4546,6011,231,1183,1734,null,1530,null,27833]
["91985",530,9,1985,12277,4177,5947,179,1199,1733,null,1483,null,26995]
["91986",531,9,1986,11789,4024,5645,221,1172,1656,null,1383,null,25890]
["91987",532,9,1987,11393,3872,5191,218,1118,1588,null,1346,null,24726]
["91988",533,9,1988,10843,3729,4767,242,1079,1544,null,1237,null,23441]
["91989",534,9,1989,10488,3650,4408,220,1035,1519,null,1191,null,22511]
["91990",535,9,1990,10263,3553,4088,294,1046,1497,null,1114,null,21855]
["91991",536,9,1991,9805,3481,3787,339,1003,1402,null,1099,null,20916]
["91992",537,9,1992,9397,3349,3489,348,966,1349,null,1124,null,20022]
["91993",538,9,1993,9020,3014,3439,303,947,1324,null,1153,null,19200]
["91994",539,9,1994,8811,2714,3516,281,894,1275,null,1253,null,18744]
["91995",540,9,1995,8298,2383,3317,282,848,1261,null,1346,null,17735]
["91996",541,9,1996,8018,2060,3045,285,816,1264,null,1250,null,16738]
[{"$f":"C542&D542","v":"91997"},542,9,1997,7978,1865,2815,285,787,1309,null,1341,null,16380]
["91998",543,9,1998,7967,1790,2818,313,754,1371,null,1684,995,17692]
["91999",544,9,1999,7779,1699,2762,334,743,1449,null,1918,951,17635]
["92000",545,9,2000,7544,1652,2820,342,766,1474,null,1852,649,17099]
["92001",546,9,2001,7249,1573,2832,316,753,1511,null,1704,428,16366]
["92002",547,9,2002,6621,1472,2725,293,703,1539,575,1677,435,16040]
["92003",548,9,2003,6410,1402,2680,271,697,1572,573,1627,811,16043]
["92004",549,9,2004,6128,1525,2581,286,662,1719,555,1664,652,15772]
["92005",550,9,2005,6264,1397,2586,281,761,1738,603,1896,676,16202]
["92006",551,9,2006,6302,1355,2688,313,784,1813,707,2015,986,16963]
[{"$f":"C552&D552","v":"92007"},552,9,2007,6277,1298,2903,315,878,1878,823,2156,898,17426]
["92008",553,9,2008,6360,1320,3016,326,924,1931,929,2080,1407,18293]
["92009",554,9,2009,6000,1269,2756,365,1011,1814,905,2036,2673,18829]
["92010",555,9,2010,5733,1240,2680,416,1064,1703,857,2199,3295,19187]
["92011",556,9,2011,5640,1214,2724,417,1064,1734,793,2173,3508,19267]
["92012",557,9,2012,5436,1233,2756,408,993,1737,785,2104,3626,19078]
["92013",558,9,2013,5160,1196,2678,403,939,1645,734,2087,3384,18226]
["92014",559,9,2014,4694,1164,2529,367,849,1661,647,2088,3407,17406]
["92015",560,9,2015,4413,1068,2440,347,824,1570,595,2038,3623,16918]
["92016",561,9,2016,4287,994,2337,340,801,1536,557,2046,3934,16832]
[{"$f":"C562&D562","v":"92017"},562,9,2017,4328,898,2296,329,807,1603,560,1980,4045,16846]
["92018",563,9,2018,4543,900,2350,326,820,1697,573,1976,3714,16899]
["92019",564,9,2019,4688,948,2560,346,824,1700,629,2030,3428,17153]
["92020",565,9,2020,4795,1012,2599,366,806,1420,612,2200,3555,17365]
["92021",566,9,2021,4761,1030,2645,335,811,1226,623,2289,3634,17354]
["92022",567,9,2022,4828,1098,2738,351,816,1379,732,2343,3412,17697]
["92023",568,9,2023,4957,1181,2717,381,883,1581,768,2399,3348,18215]
["101961",569,10,1961,87578,20726,30313,null,743,4388,null,null,null,143748]
["101962",570,10,1962,88738,21333,32259,null,852,5025,null,null,null,148207]
["101963",571,10,1963,91750,21601,34248,null,884,5807,null,null,null,154290]
[{"$f":"C572&D572","v":"101964"},572,10,1964,91989,21219,33419,null,857,6441,null,null,null,153925]
["101965",573,10,1965,89277,20867,32527,null,834,6791,null,null,null,150296]
["101966",574,10,1966,68276,16518,23706,null,674,5729,null,null,null,114903]
["101967",575,10,1967,65289,15939,21900,null,679,5678,null,null,null,109485]
["101968",576,10,1968,64755,15595,21909,null,726,6095,null,null,null,109080]
["101969",577,10,1969,74374,17444,28150,null,1398,7285,null,null,null,128651]
["101970",578,10,1970,78670,18898,28711,26,1756,7872,null,1512,null,137445]
["101971",579,10,1971,79289,20741,29923,93,2109,8494,null,1635,null,142284]
["101972",580,10,1972,79110,22796,31646,269,2230,9159,null,1885,null,147095]
["101973",581,10,1973,82080,25181,33250,574,2565,9854,null,2352,null,155856]
[{"$f":"C582&D582","v":"101974"},582,10,1974,85394,26512,34932,744,2711,10127,null,3131,null,163551]
["101975",583,10,1975,88928,26844,36226,704,2770,11319,null,3381,null,170172]
["101976",584,10,1976,91898,27325,37917,643,2800,12613,null,3323,null,176519]
["101977",585,10,1977,95815,27374,39715,524,2907,14143,null,3181,null,183659]
["101978",586,10,1978,99773,27672,40920,522,2972,15249,null,3260,null,190368]
["101979",587,10,1979,102033,28015,40526,482,2973,15788,null,3335,null,193152]
["101980",588,10,1980,102051,28668,40536,524,3001,16232,null,3077,null,194089]
["101981",589,10,1981,99041,28051,38453,477,2878,16081,null,3209,null,188190]
["101982",590,10,1982,94444,27167,36670,532,2941,16496,null,3528,null,181778]
["101983",591,10,1983,90504,26188,34808,516,2865,16983,null,3853,null,175717]
[{"$f":"C592&D592","v":"101984"},592,10,1984,87575,25567,34420,524,2760,17570,null,4261,null,172677]
["101985",593,10,1985,85544,24932,34021,454,2811,17676,null,4483,null,169921]
["101986",594,10,1986,82986,24423,32835,523,2758,17025,null,4400,null,164950]
["101987",595,10,1987,80544,23459,31018,535,2684,16716,null,4299,null,159255]
["101988",596,10,1988,78392,22484,29294,583,2664,16085,null,4171,null,153673]
["101989",597,10,1989,77060,21820,27745,557,2630,15018,null,4071,null,148901]
["101990",598,10,1990,76120,21815,26352,687,2689,13941,null,3912,null,145516]
["101991",599,10,1991,74495,21327,25076,759,2711,12767,null,3964,null,141099]
["101992",600,10,1992,73296,20097,23402,781,2698,11801,null,3952,null,136027]
["101993",601,10,1993,72449,18076,22251,728,2565,11562,null,3728,null,131359]
[{"$f":"C602&D602","v":"101994"},602,10,1994,71332,16278,21586,708,2348,11475,null,4027,null,127754]
["101995",603,10,1995,69805,14850,20212,708,2126,11363,null,4313,null,123377]
["101996",604,10,1996,68942,13837,19006,699,1770,11589,null,4089,null,119932]
["101997",605,10,1997,69307,13973,18684,682,1832,12145,null,5006,null,121629]
["101998",606,10,1998,69098,14442,18920,786,2065,13031,null,5335,1824,125501]
["101999",607,10,1999,68493,14275,19119,875,2259,13515,null,6316,2499,127351]
["102000",608,10,2000,67309,14557,19517,900,2269,13233,null,6230,2585,126600]
["102001",609,10,2001,65734,14905,19566,897,2318,12974,null,5773,1595,123762]
["102002",610,10,2002,60902,15058,18884,906,2169,12918,2819,5644,1186,120486]
["102003",611,10,2003,59028,15338,18310,870,2093,13330,2725,5721,1625,119040]
["102004",612,10,2004,58494,15481,18126,902,2044,13748,2588,6048,1640,119071]
["102005",613,10,2005,59268,15355,18490,942,2042,14441,2545,7369,1926,122378]
["102006",614,10,2006,60372,15364,19005,1047,2072,14756,2754,7677,2914,125961]
["102007",615,10,2007,61503,16098,19867,1115,2283,14818,2984,8163,2992,129823]
["102008",616,10,2008,61859,17141,19913,1144,2488,14495,3161,8032,3647,131880]
["102009",617,10,2009,59788,16654,19034,1198,2590,13546,2973,8473,7420,131676]
["102010",618,10,2010,57328,16352,18688,1250,2724,12552,2868,8675,9462,129899]
["102011",619,10,2011,56077,16273,18914,1307,2791,11840,2809,8579,9488,128078]
["102012",620,10,2012,54392,16056,18804,1333,2801,11304,2745,8272,9521,125228]
["102013",621,10,2013,52019,16173,18028,1327,2750,10351,2640,8113,9178,120579]
[{"$f":"C622&D622","v":"102014"},622,10,2014,49183,16044,16745,1255,2404,9646,2422,8162,9207,115068]
["102015",623,10,2015,46365,15491,15833,1186,2547,9075,2263,7875,9328,109963]
["102016",624,10,2016,44909,15079,15055,1151,2648,8788,2143,7933,9244,106950]
["102017",625,10,2017,44602,15159,14892,1135,2753,8905,2185,7881,9101,106613]
["102018",626,10,2018,45744,15754,14957,1128,2816,9048,2335,7831,8302,107915]
["102019",627,10,2019,46390,16446,15283,1222,2869,8910,2509,8060,7422,109111]
["102020",628,10,2020,46659,16389,15105,1268,2786,7876,2519,8574,7240,108416]
["102021",629,10,2021,46874,16239,15149,1188,2784,6914,2518,9047,6880,107593]
["102022",630,10,2022,46913,16428,15193,1218,2856,6949,2764,9536,6228,108085]
[{"$f":"C631&D631","v":"102023"},631,10,2023,46666,16804,14763,1364,2981,7195,2802,9822,5869,108266]

{"sheet":"Daten_Auswahl","index":2,"n_rows":71,"n_cols":20,"rows_kept":71,"cut":false,"hidden":true,"merged":[]}
[null,"Anzahl der Lehrlinge nach Sparten"]
[null,null,"Gewerbe und Handwerk","Industrie","Handel","Bank und Versicherung","Transport und Verkehr","Tourismus und Freizeitwirtschaft","Information und Consulting","Sonstige Lehrberechtigte","Überbetriebliche Lehrausbildung","Insgesamt"]
[null,2023,{"$f":"INDEX($B$9:$L$1000,MATCH($B3,Zeit,0),COLUMN(B1))","v":46666},16804,14763,1364,2981,7195,2802,9822,5869,108266]
[null,{"$f":"IFERROR(INDEX(Zeit,MATCH(OnClick,Zeit,0)),2000)","v":2000},{"$f":"INDEX($B$9:$L$1000,MATCH($B4,Zeit,0),COLUMN(B2))","v":67309},14557,19517,900,2269,13233,".",6230,2585,126600]
[null,{"$f":"\"Vergleich \" & B4 & \" und \" & B3","v":"Vergleich 2000 und 2023"}]
[null,null,5,6,7,8,9,10,11,12,13,14]
[null,"Nominal Werte",{"$f":"SUBSTITUTE(C8,\" \",)","v":"GewerbeundHandwerk"},{"$f":"SUBSTITUTE(D8,\" \",)","v":"Industrie"},"Handel","BankundVersicherung","TransportundVerkehr","TourismusundFreizeitwirtschaft","InformationundConsulting","SonstigeLehrberechtigte",{"$f":"SUBSTITUTE(SUBSTITUTE(K8,\" 2\",),\" \",)","v":"ÜberbetrieblicheLehrausbildung"},"Insgesamt",null,"Graph1","Graph2","GraphMax","GraphMin","Graph3_Skalierung","Skalierungsfaktor",1.3]
["Zeilenindex",null,"Gewerbe und Handwerk","Industrie","Handel","Bank und Versicherung","Transport und Verkehr","Tourismus und Freizeitwirtschaft","Information und Consulting","Sonstige Lehrberechtigte","Überbetriebliche Lehrausbildung","Insgesamt",null,{"$f":"IF(ISNA(MATCH(SUBSTITUTE(SUBSTITUTE(OnClick,\" 2\",),\" \",),Sparten,0)),\"Insgesamt\",OnClick_kurz)","v":"Insgesamt"},{"$f":"VLOOKUP(Graph1Title,S9:T18,2,FALSE) & \" - \" & Auswahl_Bundesland","v":"Insgesamt - ÖSTERREICH"},{"$f":"IF(Graph1Title=\"Insgesamt\",\"Lehrlings- und Bevölkerungsentwicklung im Vergleich ³\",\"\")","v":"Lehrlings- und Bevölkerungsentwicklung im Vergleich ³"}]
[{"$f":"VLOOKUP(Bundesland&Daten_Auswahl!$B9,Daten_Matrix,2,FALSE)","v":569},1961,{"$f":"IF(ISERROR($A9),0,IF(INDEX(Daten_Matrix,$A9,C$6)=0,\".\",INDEX(Daten_Matrix,$A9,C$6)))","v":87578},20726,30313,".",743,4388,".",".",".",143748,null,{"$f":"INDEX(INDIRECT(Graph1Title),ROW(A1))","v":143748},{"$f":"IF(SUM(P9:Q9)=0,N9,0)","v":143748},{"$f":"IF(N9>=LARGE(Graph1,5),N9,0)","v":0},{"$f":"IF(N9<=SMALL(Graph1,5),N9,0)","v":0},{"$f":"N9*Skalierungsfaktor","v":186872.4},"GewerbeundHandwerk","Gewerbe und Handwerk"]
[{"$f":"VLOOKUP(Bundesland&Daten_Auswahl!$B10,Daten_Matrix,2,FALSE)","v":570},1962,88738,21333,32259,".",852,5025,".",".",".",148207,null,{"$f":"INDEX(INDIRECT(Graph1Title),ROW(A2))","v":148207},148207,{"$f":"IF(N10>=LARGE(Graph1,5),N10,0)","v":0},{"$f":"IF(N10<=SMALL(Graph1,5),N10,0)","v":0},192669.1,"Industrie","Industrie"]
[{"$f":"VLOOKUP(Bundesland&Daten_Auswahl!$B11,Daten_Matrix,2,FALSE)","v":571},1963,91750,21601,34248,".",884,5807,".",".",".",154290,null,154290,154290,{"$f":"IF(N11>=LARGE(Graph1,5),N11,0)","v":0},{"$f":"IF(N11<=SMALL(Graph1,5),N11,0)","v":0},200577,"Handel","Handel"]
[{"$f":"VLOOKUP(Bundesland&Daten_Auswahl!$B12,Daten_Matrix,2,FALSE)","v":572},1964,91989,21219,33419,".",857,6441,".",".",".",153925,null,153925,153925,{"$f":"IF(N12>=LARGE(Graph1,5),N12,0)","v":0},{"$f":"IF(N12<=SMALL(Graph1,5),N12,0)","v":0},200102.5,"BankundVersicherung","Bank und Versicherung"]
[{"$f":"VLOOKUP(Bundesland&Daten_Auswahl!$B13,Daten_Matrix,2,FALSE)","v":573},1965,89277,20867,32527,".",834,6791,".",".",".",150296,null,150296,150296,{"$f":"IF(N13>=LARGE(Graph1,5),N13,0)","v":0},{"$f":"IF(N13<=SMALL(Graph1,5),N13,0)","v":0},195384.80000000002,"TransportundVerkehr","Transport und Verkehr"]
[{"$f":"VLOOKUP(Bundesland&Daten_Auswahl!$B14,Daten_Matrix,2,FALSE)","v":574},1966,68276,16518,23706,".",674,5729,".",".",".",114903,null,114903,114903,{"$f":"IF(N14>=LARGE(Graph1,5),N14,0)","v":0},{"$f":"IF(N14<=SMALL(Graph1,5),N14,0)","v":0},149373.9,"TourismusundFreizeitwirtschaft","Tourismus und Freizeitwirtschaft"]
[{"$f":"VLOOKUP(Bundesland&Daten_Auswahl!$B15,Daten_Matrix,2,FALSE)","v":575},1967,65289,15939,21900,".",679,5678,".",".",".",109485,null,109485,109485,{"$f":"IF(N15>=LARGE(Graph1,5),N15,0)","v":0},{"$f":"IF(N15<=SMALL(Graph1,5),N15,0)","v":0},142330.5,"InformationundConsulting","Information und Consulting"]
[{"$f":"VLOOKUP(Bundesland&Daten_Auswahl!$B16,Daten_Matrix,2,FALSE)","v":576},1968,64755,15595,21909,".",726,6095,".",".",".",109080,null,109080,109080,{"$f":"IF(N16>=LARGE(Graph1,5),N16,0)","v":0},{"$f":"IF(N16<=SMALL(Graph1,5),N16,0)","v":0},141804,"SonstigeLehrberechtigte","Sonstige Lehrberechtigte"]
[{"$f":"VLOOKUP(Bundesland&Daten_Auswahl!$B17,Daten_Matrix,2,FALSE)","v":577},1969,74374,17444,28150,".",1398,7285,".",".",".",128651,null,128651,128651,{"$f":"IF(N17>=LARGE(Graph1,5),N17,0)","v":0},{"$f":"IF(N17<=SMALL(Graph1,5),N17,0)","v":0},167246.30000000002,"ÜberbetrieblicheLehrausbildung","Überbetriebliche Lehrausbildung"]
[{"$f":"VLOOKUP(Bundesland&Daten_Auswahl!$B18,Daten_Matrix,2,FALSE)","v":578},1970,78670,18898,28711,26,1756,7872,".",1512,".",137445,null,137445,137445,{"$f":"IF(N18>=LARGE(Graph1,5),N18,0)","v":0},{"$f":"IF(N18<=SMALL(Graph1,5),N18,0)","v":0},178678.5,"Insgesamt","Insgesamt"]
[{"$f":"VLOOKUP(Bundesland&Daten_Auswahl!$B19,Daten_Matrix,2,FALSE)","v":579},1971,{"$f":"IF(ISERROR($A19),0,IF(INDEX(Daten_Matrix,$A19,C$6)=0,\".\",INDEX(Daten_Matrix,$A19,C$6)))","v":79289},20741,29923,93,2109,8494,".",1635,".",142284,null,142284,142284,{"$f":"IF(N19>=LARGE(Graph1,5),N19,0)","v":0},{"$f":"IF(N19<=SMALL(Graph1,5),N19,0)","v":0},184969.2]
[{"$f":"VLOOKUP(Bundesland&Daten_Auswahl!$B20,Daten_Matrix,2,FALSE)","v":580},1972,79110,22796,31646,269,2230,9159,".",1885,".",147095,null,147095,147095,{"$f":"IF(N20>=LARGE(Graph1,5),N20,0)","v":0},{"$f":"IF(N20<=SMALL(Graph1,5),N20,0)","v":0},191223.5]
[{"$f":"VLOOKUP(Bundesland&Daten_Auswahl!$B21,Daten_Matrix,2,FALSE)","v":581},1973,82080,25181,33250,574,2565,9854,".",2352,".",155856,null,155856,155856,{"$f":"IF(N21>=LARGE(Graph1,5),N21,0)","v":0},{"$f":"IF(N21<=SMALL(Graph1,5),N21,0)","v":0},202612.80000000002]
[{"$f":"VLOOKUP(Bundesland&Daten_Auswahl!$B22,Daten_Matrix,2,FALSE)","v":582},1974,85394,26512,34932,744,2711,10127,".",3131,".",163551,null,163551,163551,{"$f":"IF(N22>=LARGE(Graph1,5),N22,0)","v":0},{"$f":"IF(N22<=SMALL(Graph1,5),N22,0)","v":0},212616.30000000002]
[{"$f":"VLOOKUP(Bundesland&Daten_Auswahl!$B23,Daten_Matrix,2,FALSE)","v":583},1975,88928,26844,36226,704,2770,11319,".",3381,".",170172,null,170172,170172,{"$f":"IF(N23>=LARGE(Graph1,5),N23,0)","v":0},{"$f":"IF(N23<=SMALL(Graph1,5),N23,0)","v":0},221223.6]
[{"$f":"VLOOKUP(Bundesland&Daten_Auswahl!$B24,Daten_Matrix,2,FALSE)","v":584},1976,91898,27325,37917,643,2800,12613,".",3323,".",176519,null,176519,176519,{"$f":"IF(N24>=LARGE(Graph1,5),N24,0)","v":0},{"$f":"IF(N24<=SMALL(Graph1,5),N24,0)","v":0},229474.7]
[{"$f":"VLOOKUP(Bundesland&Daten_Auswahl!$B25,Daten_Matrix,2,FALSE)","v":585},1977,95815,27374,39715,524,2907,14143,".",3181,".",183659,null,183659,0,{"$f":"IF(N25>=LARGE(Graph1,5),N25,0)","v":183659},{"$f":"IF(N25<=SMALL(Graph1,5),N25,0)","v":0},238756.7]
[{"$f":"VLOOKUP(Bundesland&Daten_Auswahl!$B26,Daten_Matrix,2,FALSE)","v":586},1978,99773,27672,40920,522,2972,15249,".",3260,".",190368,null,190368,0,{"$f":"IF(N26>=LARGE(Graph1,5),N26,0)","v":190368},{"$f":"IF(N26<=SMALL(Graph1,5),N26,0)","v":0},247478.39999999999]
[{"$f":"VLOOKUP(Bundesland&Daten_Auswahl!$B27,Daten_Matrix,2,FALSE)","v":587},1979,102033,28015,40526,482,2973,15788,".",3335,".",193152,null,193152,0,{"$f":"IF(N27>=LARGE(Graph1,5),N27,0)","v":193152},{"$f":"IF(N27<=SMALL(Graph1,5),N27,0)","v":0},251097.60000000001]
[{"$f":"VLOOKUP(Bundesland&Daten_Auswahl!$B28,Daten_Matrix,2,FALSE)","v":588},1980,102051,28668,40536,524,3001,16232,".",3077,".",194089,null,194089,0,{"$f":"IF(N28>=LARGE(Graph1,5),N28,0)","v":194089},{"$f":"IF(N28<=SMALL(Graph1,5),N28,0)","v":0},252315.7]
[{"$f":"VLOOKUP(Bundesland&Daten_Auswahl!$B29,Daten_Matrix,2,FALSE)","v":589},1981,{"$f":"IF(ISERROR($A29),0,IF(INDEX(Daten_Matrix,$A29,C$6)=0,\".\",INDEX(Daten_Matrix,$A29,C$6)))","v":99041},28051,38453,477,2878,16081,".",3209,".",188190,null,188190,0,{"$f":"IF(N29>=LARGE(Graph1,5),N29,0)","v":188190},{"$f":"IF(N29<=SMALL(Graph1,5),N29,0)","v":0},244647]
[{"$f":"VLOOKUP(Bundesland&Daten_Auswahl!$B30,Daten_Matrix,2,FALSE)","v":590},1982,94444,27167,36670,532,2941,16496,".",3528,".",181778,null,181778,181778,{"$f":"IF(N30>=LARGE(Graph1,5),N30,0)","v":0},{"$f":"IF(N30<=SMALL(Graph1,5),N30,0)","v":0},236311.4]
[{"$f":"VLOOKUP(Bundesland&Daten_Auswahl!$B31,Daten_Matrix,2,FALSE)","v":591},1983,90504,26188,34808,516,2865,16983,".",3853,".",175717,null,175717,175717,{"$f":"IF(N31>=LARGE(Graph1,5),N31,0)","v":0},{"$f":"IF(N31<=SMALL(Graph1,5),N31,0)","v":0},228432.1]
[{"$f":"VLOOKUP(Bundesland&Daten_Auswahl!$B32,Daten_Matrix,2,FALSE)","v":592},1984,87575,25567,34420,524,2760,17570,".",4261,".",172677,null,172677,172677,{"$f":"IF(N32>=LARGE(Graph1,5),N32,0)","v":0},{"$f":"IF(N32<=SMALL(Graph1,5),N32,0)","v":0},224480.1]
[{"$f":"VLOOKUP(Bundesland&Daten_Auswahl!$B33,Daten_Matrix,2,FALSE)","v":593},1985,85544,24932,34021,454,2811,17676,".",4483,".",169921,null,169921,169921,{"$f":"IF(N33>=LARGE(Graph1,5),N33,0)","v":0},{"$f":"IF(N33<=SMALL(Graph1,5),N33,0)","v":0},220897.30000000002]
[{"$f":"VLOOKUP(Bundesland&Daten_Auswahl!$B34,Daten_Matrix,2,FALSE)","v":594},1986,82986,24423,32835,523,2758,17025,".",4400,".",164950,null,164950,164950,{"$f":"IF(N34>=LARGE(Graph1,5),N34,0)","v":0},{"$f":"IF(N34<=SMALL(Graph1,5),N34,0)","v":0},{"$f":"N34*Skalierungsfaktor","v":214435}]
[{"$f":"VLOOKUP(Bundesland&Daten_Auswahl!$B35,Daten_Matrix,2,FALSE)","v":595},1987,80544,23459,31018,535,2684,16716,".",4299,".",159255,null,159255,159255,{"$f":"IF(N35>=LARGE(Graph1,5),N35,0)","v":0},{"$f":"IF(N35<=SMALL(Graph1,5),N35,0)","v":0},207031.5]
[{"$f":"VLOOKUP(Bundesland&Daten_Auswahl!$B36,Daten_Matrix,2,FALSE)","v":596},1988,78392,22484,29294,583,2664,16085,".",4171,".",153673,null,153673,153673,{"$f":"IF(N36>=LARGE(Graph1,5),N36,0)","v":0},{"$f":"IF(N36<=SMALL(Graph1,5),N36,0)","v":0},199774.9]
[{"$f":"VLOOKUP(Bundesland&Daten_Auswahl!$B37,Daten_Matrix,2,FALSE)","v":597},1989,77060,21820,27745,557,2630,15018,".",4071,".",148901,null,148901,148901,{"$f":"IF(N37>=LARGE(Graph1,5),N37,0)","v":0},{"$f":"IF(N37<=SMALL(Graph1,5),N37,0)","v":0},193571.30000000002]
[{"$f":"VLOOKUP(Bundesland&Daten_Auswahl!$B38,Daten_Matrix,2,FALSE)","v":598},1990,76120,21815,26352,687,2689,13941,".",3912,".",145516,null,145516,145516,{"$f":"IF(N38>=LARGE(Graph1,5),N38,0)","v":0},{"$f":"IF(N38<=SMALL(Graph1,5),N38,0)","v":0},189170.80000000002]
[{"$f":"VLOOKUP(Bundesland&Daten_Auswahl!$B39,Daten_Matrix,2,FALSE)","v":599},1991,{"$f":"IF(ISERROR($A39),0,IF(INDEX(Daten_Matrix,$A39,C$6)=0,\".\",INDEX(Daten_Matrix,$A39,C$6)))","v":74495},21327,25076,759,2711,12767,".",3964,".",141099,null,141099,141099,{"$f":"IF(N39>=LARGE(Graph1,5),N39,0)","v":0},{"$f":"IF(N39<=SMALL(Graph1,5),N39,0)","v":0},183428.7]
[{"$f":"VLOOKUP(Bundesland&Daten_Auswahl!$B40,Daten_Matrix,2,FALSE)","v":600},1992,73296,20097,23402,781,2698,11801,".",3952,".",136027,null,136027,136027,{"$f":"IF(N40>=LARGE(Graph1,5),N40,0)","v":0},{"$f":"IF(N40<=SMALL(Graph1,5),N40,0)","v":0},176835.1]
[{"$f":"VLOOKUP(Bundesland&Daten_Auswahl!$B41,Daten_Matrix,2,FALSE)","v":601},1993,72449,18076,22251,728,2565,11562,".",3728,".",131359,null,{"$f":"INDEX(INDIRECT(Graph1Title),ROW(A33))","v":131359},131359,{"$f":"IF(N41>=LARGE(Graph1,5),N41,0)","v":0},{"$f":"IF(N41<=SMALL(Graph1,5),N41,0)","v":0},170766.7]
[{"$f":"VLOOKUP(Bundesland&Daten_Auswahl!$B42,Daten_Matrix,2,FALSE)","v":602},1994,71332,16278,21586,708,2348,11475,".",4027,".",127754,null,127754,127754,{"$f":"IF(N42>=LARGE(Graph1,5),N42,0)","v":0},{"$f":"IF(N42<=SMALL(Graph1,5),N42,0)","v":0},166080.20000000001]
[{"$f":"VLOOKUP(Bundesland&Daten_Auswahl!$B43,Daten_Matrix,2,FALSE)","v":603},1995,69805,14850,20212,708,2126,11363,".",4313,".",123377,null,123377,123377,{"$f":"IF(N43>=LARGE(Graph1,5),N43,0)","v":0},{"$f":"IF(N43<=SMALL(Graph1,5),N43,0)","v":0},160390.1]
[{"$f":"VLOOKUP(Bundesland&Daten_Auswahl!$B44,Daten_Matrix,2,FALSE)","v":604},1996,68942,13837,19006,699,1770,11589,".",4089,".",119932,null,119932,119932,{"$f":"IF(N44>=LARGE(Graph1,5),N44,0)","v":0},{"$f":"IF(N44<=SMALL(Graph1,5),N44,0)","v":0},155911.6]
[{"$f":"VLOOKUP(Bundesland&Daten_Auswahl!$B45,Daten_Matrix,2,FALSE)","v":605},1997,69307,13973,18684,682,1832,12145,".",5006,".",121629,null,121629,121629,{"$f":"IF(N45>=LARGE(Graph1,5),N45,0)","v":0},{"$f":"IF(N45<=SMALL(Graph1,5),N45,0)","v":0},158117.70000000001]
[{"$f":"VLOOKUP(Bundesland&Daten_Auswahl!$B46,Daten_Matrix,2,FALSE)","v":606},1998,69098,14442,18920,786,2065,13031,".",5335,1824,125501,null,125501,125501,{"$f":"IF(N46>=LARGE(Graph1,5),N46,0)","v":0},{"$f":"IF(N46<=SMALL(Graph1,5),N46,0)","v":0},163151.30000000002]
[{"$f":"VLOOKUP(Bundesland&Daten_Auswahl!$B47,Daten_Matrix,2,FALSE)","v":607},1999,68493,14275,19119,875,2259,13515,".",6316,2499,127351,null,127351,127351,{"$f":"IF(N47>=LARGE(Graph1,5),N47,0)","v":0},{"$f":"IF(N47<=SMALL(Graph1,5),N47,0)","v":0},165556.30000000002]
[{"$f":"VLOOKUP(Bundesland&Daten_Auswahl!$B48,Daten_Matrix,2,FALSE)","v":608},2000,67309,14557,19517,900,2269,13233,".",6230,2585,126600,null,126600,126600,{"$f":"IF(N48>=LARGE(Graph1,5),N48,0)","v":0},{"$f":"IF(N48<=SMALL(Graph1,5),N48,0)","v":0},164580]
[{"$f":"VLOOKUP(Bundesland&Daten_Auswahl!$B49,Daten_Matrix,2,FALSE)","v":609},2001,{"$f":"IF(ISERROR($A49),0,IF(INDEX(Daten_Matrix,$A49,C$6)=0,\".\",INDEX(Daten_Matrix,$A49,C$6)))","v":65734},14905,19566,897,2318,12974,".",5773,1595,123762,null,123762,123762,{"$f":"IF(N49>=LARGE(Graph1,5),N49,0)","v":0},{"$f":"IF(N49<=SMALL(Graph1,5),N49,0)","v":0},160890.6]
[{"$f":"VLOOKUP(Bundesland&Daten_Auswahl!$B50,Daten_Matrix,2,FALSE)","v":610},2002,60902,15058,18884,906,2169,12918,2819,5644,1186,120486,null,120486,120486,{"$f":"IF(N50>=LARGE(Graph1,5),N50,0)","v":0},{"$f":"IF(N50<=SMALL(Graph1,5),N50,0)","v":0},156631.80000000002]
[{"$f":"VLOOKUP(Bundesland&Daten_Auswahl!$B51,Daten_Matrix,2,FALSE)","v":611},2003,59028,15338,18310,870,2093,13330,2725,5721,1625,119040,null,119040,119040,{"$f":"IF(N51>=LARGE(Graph1,5),N51,0)","v":0},{"$f":"IF(N51<=SMALL(Graph1,5),N51,0)","v":0},154752]
[{"$f":"VLOOKUP(Bundesland&Daten_Auswahl!$B52,Daten_Matrix,2,FALSE)","v":612},2004,58494,15481,18126,902,2044,13748,2588,6048,1640,119071,null,119071,119071,{"$f":"IF(N52>=LARGE(Graph1,5),N52,0)","v":0},{"$f":"IF(N52<=SMALL(Graph1,5),N52,0)","v":0},154792.30000000002]
[{"$f":"VLOOKUP(Bundesland&Daten_Auswahl!$B53,Daten_Matrix,2,FALSE)","v":613},2005,59268,15355,18490,942,2042,14441,2545,7369,1926,122378,null,122378,122378,{"$f":"IF(N53>=LARGE(Graph1,5),N53,0)","v":0},{"$f":"IF(N53<=SMALL(Graph1,5),N53,0)","v":0},159091.4]
[{"$f":"VLOOKUP(Bundesland&Daten_Auswahl!$B54,Daten_Matrix,2,FALSE)","v":614},2006,60372,15364,19005,1047,2072,14756,2754,7677,2914,125961,null,125961,125961,{"$f":"IF(N54>=LARGE(Graph1,5),N54,0)","v":0},{"$f":"IF(N54<=SMALL(Graph1,5),N54,0)","v":0},163749.30000000002]
[{"$f":"VLOOKUP(Bundesland&Daten_Auswahl!$B55,Daten_Matrix,2,FALSE)","v":615},2007,61503,16098,19867,1115,2283,14818,2984,8163,2992,129823,null,129823,129823,{"$f":"IF(N55>=LARGE(Graph1,5),N55,0)","v":0},{"$f":"IF(N55<=SMALL(Graph1,5),N55,0)","v":0},168769.9]
[{"$f":"VLOOKUP(Bundesland&Daten_Auswahl!$B56,Daten_Matrix,2,FALSE)","v":616},2008,61859,17141,19913,1144,2488,14495,3161,8032,3647,131880,null,131880,131880,{"$f":"IF(N56>=LARGE(Graph1,5),N56,0)","v":0},{"$f":"IF(N56<=SMALL(Graph1,5),N56,0)","v":0},171444]
[{"$f":"VLOOKUP(Bundesland&Daten_Auswahl!$B57,Daten_Matrix,2,FALSE)","v":617},2009,59788,16654,19034,1198,2590,13546,2973,8473,7420,131676,null,131676,131676,{"$f":"IF(N57>=LARGE(Graph1,5),N57,0)","v":0},{"$f":"IF(N57<=SMALL(Graph1,5),N57,0)","v":0},171178.80000000002]
[{"$f":"VLOOKUP(Bundesland&Daten_Auswahl!$B58,Daten_Matrix,2,FALSE)","v":618},2010,57328,16352,18688,1250,2724,12552,2868,8675,9462,129899,null,129899,129899,{"$f":"IF(N58>=LARGE(Graph1,5),N58,0)","v":0},{"$f":"IF(N58<=SMALL(Graph1,5),N58,0)","v":0},168868.7]
[{"$f":"VLOOKUP(Bundesland&Daten_Auswahl!$B59,Daten_Matrix,2,FALSE)","v":619},2011,56077,16273,18914,1307,2791,11840,2809,8579,9488,128078,null,128078,128078,{"$f":"IF(N59>=LARGE(Graph1,5),N59,0)","v":0},{"$f":"IF(N59<=SMALL(Graph1,5),N59,0)","v":0},166501.4]
[{"$f":"VLOOKUP(Bundesland&Daten_Auswahl!$B60,Daten_Matrix,2,FALSE)","v":620},2012,54392,16056,18804,1333,2801,11304,2745,8272,9521,125228,null,125228,125228,{"$f":"IF(N60>=LARGE(Graph1,5),N60,0)","v":0},{"$f":"IF(N60<=SMALL(Graph1,5),N60,0)","v":0},162796.4]
[{"$f":"VLOOKUP(Bundesland&Daten_Auswahl!$B61,Daten_Matrix,2,FALSE)","v":621},2013,52019,16173,18028,1327,2750,10351,2640,8113,9178,120579,null,120579,120579,{"$f":"IF(N61>=LARGE(Graph1,5),N61,0)","v":0},{"$f":"IF(N61<=SMALL(Graph1,5),N61,0)","v":0},156752.70000000001]
[{"$f":"VLOOKUP(Bundesland&Daten_Auswahl!$B62,Daten_Matrix,2,FALSE)","v":622},2014,49183,16044,16745,1255,2404,9646,2422,8162,9207,115068,null,115068,115068,{"$f":"IF(N62>=LARGE(Graph1,5),N62,0)","v":0},{"$f":"IF(N62<=SMALL(Graph1,5),N62,0)","v":0},149588.4]
[{"$f":"VLOOKUP(Bundesland&Daten_Auswahl!$B63,Daten_Matrix,2,FALSE)","v":623},2015,46365,15491,15833,1186,2547,9075,2263,7875,9328,109963,null,{"$f":"INDEX(INDIRECT(Graph1Title),ROW(A55))","v":109963},{"$f":"IF(SUM(P63:Q63)=0,N63,0)","v":109963},{"$f":"IF(N63>=LARGE(Graph1,5),N63,0)","v":0},{"$f":"IF(N63<=SMALL(Graph1,5),N63,0)","v":0},{"$f":"N63*Skalierungsfaktor","v":142951.9}]
[{"$f":"VLOOKUP(Bundesland&Daten_Auswahl!$B64,Daten_Matrix,2,FALSE)","v":624},2016,44909,15079,15055,1151,2648,8788,2143,7933,9244,106950,null,106950,0,{"$f":"IF(N64>=LARGE(Graph1,5),N64,0)","v":0},{"$f":"IF(N64<=SMALL(Graph1,5),N64,0)","v":106950},139035]
[{"$f":"VLOOKUP(Bundesland&Daten_Auswahl!$B65,Daten_Matrix,2,FALSE)","v":625},2017,44602,15159,14892,1135,2753,8905,2185,7881,9101,106613,null,106613,{"$f":"IF(SUM(P65:Q65)=0,N65,0)","v":0},{"$f":"IF(N65>=LARGE(Graph1,5),N65,0)","v":0},{"$f":"IF(N65<=SMALL(Graph1,5),N65,0)","v":106613},{"$f":"N65*Skalierungsfaktor","v":138596.9}]
[{"$f":"VLOOKUP(Bundesland&Daten_Auswahl!$B66,Daten_Matrix,2,FALSE)","v":626},2018,45744,15754,14957,1128,2816,9048,2335,7831,8302,107915,null,107915,0,{"$f":"IF(N66>=LARGE(Graph1,5),N66,0)","v":0},{"$f":"IF(N66<=SMALL(Graph1,5),N66,0)","v":107915},140289.5]
[{"$f":"VLOOKUP(Bundesland&Daten_Auswahl!$B67,Daten_Matrix,2,FALSE)","v":627},2019,46390,16446,15283,1222,2869,8910,2509,8060,7422,109111,null,109111,{"$f":"IF(SUM(P67:Q67)=0,N67,0)","v":109111},{"$f":"IF(N67>=LARGE(Graph1,5),N67,0)","v":0},{"$f":"IF(N67<=SMALL(Graph1,5),N67,0)","v":0},{"$f":"N67*Skalierungsfaktor","v":141844.30000000002}]
[{"$f":"VLOOKUP(Bundesland&Daten_Auswahl!$B68,Daten_Matrix,2,FALSE)","v":628},2020,46659,16389,15105,1268,2786,7876,2519,8574,7240,108416,null,108416,{"$f":"IF(SUM(P68:Q68)=0,N68,0)","v":108416},{"$f":"IF(N68>=LARGE(Graph1,5),N68,0)","v":0},{"$f":"IF(N68<=SMALL(Graph1,5),N68,0)","v":0},{"$f":"N68*Skalierungsfaktor","v":140940.80000000002}]
[{"$f":"VLOOKUP(Bundesland&Daten_Auswahl!$B69,Daten_Matrix,2,FALSE)","v":629},2021,46874,16239,15149,1188,2784,6914,2518,9047,6880,107593,null,{"$f":"INDEX(INDIRECT(Graph1Title),ROW(A61))","v":107593},{"$f":"IF(SUM(P69:Q69)=0,N69,0)","v":0},{"$f":"IF(N69>=LARGE(Graph1,5),N69,0)","v":0},{"$f":"IF(N69<=SMALL(Graph1,5),N69,0)","v":107593},{"$f":"N69*Skalierungsfaktor","v":139870.9}]
[{"$f":"VLOOKUP(Bundesland&Daten_Auswahl!$B70,Daten_Matrix,2,FALSE)","v":630},2022,46913,16428,15193,1218,2856,6949,2764,9536,6228,108085,null,{"$f":"INDEX(INDIRECT(Graph1Title),ROW(A62))","v":108085},{"$f":"IF(SUM(P70:Q70)=0,N70,0)","v":0},{"$f":"IF(N70>=LARGE(Graph1,5),N70,0)","v":0},{"$f":"IF(N70<=SMALL(Graph1,5),N70,0)","v":108085},{"$f":"N70*Skalierungsfaktor","v":140510.5}]
[{"$f":"VLOOKUP(Bundesland&Daten_Auswahl!$B71,Daten_Matrix,2,FALSE)","v":631},2023,46666,16804,14763,1364,2981,7195,2802,9822,5869,108266,null,{"$f":"INDEX(INDIRECT(Graph1Title),ROW(A63))","v":108266},{"$f":"IF(SUM(P71:Q71)=0,N71,0)","v":108266},{"$f":"IF(N71>=LARGE(Graph1,5),N71,0)","v":0},{"$f":"IF(N71<=SMALL(Graph1,5),N71,0)","v":0},{"$f":"N71*Skalierungsfaktor","v":140745.80000000002}]

{"sheet":"Bev_15_20","index":3,"n_rows":721,"n_cols":5,"rows_kept":721,"cut":false,"hidden":true,"merged":[]}
["BDL(alpha)_Jahr","Zeilenindex","BDL","Jahr","SummevonBevoelkerung"]
[{"$f":"C2&D2","v":"11952"},2,1,1952,27430]
["11953",3,1,1953,26587]
["11954",4,1,1954,26406]
["11955",5,1,1955,26917]
["11956",6,1,1956,26929]
["11957",7,1,1957,26148]
["11958",8,1,1958,25183]
["11959",9,1,1959,24395]
["11960",10,1,1960,22686]
["11961",11,1,1961,20176]
["11962",12,1,1962,18954]
["11963",13,1,1963,19516]
["11964",14,1,1964,20692]
["11965",15,1,1965,21858]
["11966",16,1,1966,23418]
["11967",17,1,1967,25108]
["11968",18,1,1968,25939]
["11969",19,1,1969,26012]
["11970",20,1,1970,26091]
["11971",21,1,1971,26325]
["11972",22,1,1972,26597]
["11973",23,1,1973,26850]
["11974",24,1,1974,27220]
["11975",25,1,1975,27646]
["11976",26,1,1976,27954]
["11977",27,1,1977,28255]
["11978",28,1,1978,28518]
["11979",29,1,1979,28650]
["11980",30,1,1980,28365]
["11981",31,1,1981,27934]
["11982",32,1,1982,27661]
["11983",33,1,1983,27080]
["11984",34,1,1984,26189]
["11985",35,1,1985,25281]
["11986",36,1,1986,24644]
["11987",37,1,1987,24146]
["11988",38,1,1988,23620]
["11989",39,1,1989,23267]
["11990",40,1,1990,22967]
["11991",41,1,1991,22554]
["11992",42,1,1992,21907]
["11993",43,1,1993,21130]
["11994",44,1,1994,20492]
["11995",45,1,1995,20093]
["11996",46,1,1996,20021]
["11997",47,1,1997,20128]
["11998",48,1,1998,20222]
["11999",49,1,1999,20341]
["12000",50,1,2000,20394]
["12001",51,1,2001,20211]
["12002",52,1,2002,19809]
["12003",53,1,2003,19481]
["12004",54,1,2004,19334]
["12005",55,1,2005,19239]
[{"$f":"C56&D56","v":"12006"},56,1,2006,19073]
["12007",57,1,2007,18920]
["12008",58,1,2008,18891]
["12009",59,1,2009,18907]
["12010",60,1,2010,18655]
["12011",61,1,2011,18388]
["12012",62,1,2012,18119]
["12013",63,1,2013,17896]
["12014",64,1,2014,17601]
["12015",65,1,2015,17240]
["12016",66,1,2016,17198]
["12017",67,1,2017,16941]
["12018",68,1,2018,16622]
["12019",69,1,2019,16403]
["12020",70,1,2020,16272]
["12021",71,1,2021,16274]
["12022",72,1,2022,16570]
["12023",73,1,2023,16705]
["21952",74,2,1952,40092]
["21953",75,2,1953,39143]
["21954",76,2,1954,40159]
["21955",77,2,1955,42925]
["21956",78,2,1956,45520]
["21957",79,2,1957,47675]
["21958",80,2,1958,49381]
["21959",81,2,1959,50607]
["21960",82,2,1960,49997]
["21961",83,2,1961,47974]
["21962",84,2,1962,46743]
["21963",85,2,1963,46391]
["21964",86,2,1964,46567]
["21965",87,2,1965,46814]
["21966",88,2,1966,48079]
["21967",89,2,1967,49275]
["21968",90,2,1968,49249]
["21969",91,2,1969,49444]
["21970",92,2,1970,50428]
["21971",93,2,1971,51973]
["21972",94,2,1972,53761]
["21973",95,2,1973,55234]
["21974",96,2,1974,56212]
["21975",97,2,1975,57020]
["21976",98,2,1976,57984]
["21977",99,2,1977,58858]
["21978",100,2,1978,59413]
["21979",101,2,1979,59934]
["21980",102,2,1980,60283]
["21981",103,2,1981,60118]
["21982",104,2,1982,59608]
["21983",105,2,1983,58939]
["21984",106,2,1984,58011]
["21985",107,2,1985,56521]
["21986",108,2,1986,54715]
["21987",109,2,1987,53050]
[{"$f":"C110&D110","v":"21988"},110,2,1988,51162]
["21989",111,2,1989,49090]
["21990",112,2,1990,47039]
["21991",113,2,1991,45271]
["21992",114,2,1992,43974]
["21993",115,2,1993,42664]
["21994",116,2,1994,41527]
["21995",117,2,1995,41111]
["21996",118,2,1996,41145]
["21997",119,2,1997,41389]
["21998",120,2,1998,41843]
["21999",121,2,1999,42243]
["22000",122,2,2000,42501]
["22001",123,2,2001,42428]
["22002",124,2,2002,41898]
["22003",125,2,2003,41312]
["22004",126,2,2004,40849]
["22005",127,2,2005,40728]
["22006",128,2,2006,40663]
["22007",129,2,2007,40680]
["22008",130,2,2008,40725]
["22009",131,2,2009,40491]
["22010",132,2,2010,39955]
["22011",133,2,2011,39375]
["22012",134,2,2012,38449]
["22013",135,2,2013,37289]
["22014",136,2,2014,36273]
["22015",137,2,2015,35477]
["22016",138,2,2016,34842]
["22017",139,2,2017,33807]
["22018",140,2,2018,32948]
["22019",141,2,2019,32423]
["22020",142,2,2020,32123]
["22021",143,2,2021,32086]
["22022",144,2,2022,32394]
["22023",145,2,2023,32424]
["31952",146,3,1952,112653]
["31953",147,3,1953,111631]
["31954",148,3,1954,115279]
["31955",149,3,1955,122467]
["31956",150,3,1956,127985]
["31957",151,3,1957,130299]
["31958",152,3,1958,131173]
["31959",153,3,1959,131648]
["31960",154,3,1960,125505]
["31961",155,3,1961,114034]
["31962",156,3,1962,107615]
["31963",157,3,1963,107511]
["31964",158,3,1964,108616]
["31965",159,3,1965,108974]
["31966",160,3,1966,111598]
["31967",161,3,1967,116140]
["31968",162,3,1968,117404]
["31969",163,3,1969,116365]
["31970",164,3,1970,117344]
["31971",165,3,1971,119989]
[{"$f":"C166&D166","v":"31972"},166,3,1972,123050]
["31973",167,3,1973,126086]
["31974",168,3,1974,128605]
["31975",169,3,1975,131258]
["31976",170,3,1976,135197]
["31977",171,3,1977,139537]
["31978",172,3,1978,143053]
["31979",173,3,1979,146295]
["31980",174,3,1980,148964]
["31981",175,3,1981,150779]
["31982",176,3,1982,150481]
["31983",177,3,1983,148039]
["31984",178,3,1984,145046]
["31985",179,3,1985,141240]
["31986",180,3,1986,137195]
["31987",181,3,1987,133015]
["31988",182,3,1988,128226]
["31989",183,3,1989,123989]
["31990",184,3,1990,120732]
["31991",185,3,1991,117391]
["31992",186,3,1992,114016]
["31993",187,3,1993,110520]
["31994",188,3,1994,107335]
["31995",189,3,1995,105460]
["31996",190,3,1996,104968]
["31997",191,3,1997,105781]
["31998",192,3,1998,107388]
["31999",193,3,1999,109322]
["32000",194,3,2000,110882]
["32001",195,3,2001,111413]
["32002",196,3,2002,111169]
["32003",197,3,2003,111148]
["32004",198,3,2004,111802]
["32005",199,3,2005,113043]
["32006",200,3,2006,114656]
["32007",201,3,2007,116117]
["32008",202,3,2008,117383]
["32009",203,3,2009,117952]
["32010",204,3,2010,117331]
["32011",205,3,2011,116399]
["32012",206,3,2012,114699]
["32013",207,3,2013,112281]
["32014",208,3,2014,109890]
["32015",209,3,2015,108499]
["32016",210,3,2016,108521]
["32017",211,3,2017,105996]
["32018",212,3,2018,103774]
["32019",213,3,2019,102486]
["32020",214,3,2020,102028]
["32021",215,3,2021,101947]
["32022",216,3,2022,103194]
["32023",217,3,2023,103597]
["41952",218,4,1952,95018]
["41953",219,4,1953,93518]
["41954",220,4,1954,95600]
["41955",221,4,1955,101254]
["41956",222,4,1956,106753]
[{"$f":"C223&D223","v":"41957"},223,4,1957,110321]
["41958",224,4,1958,112710]
["41959",225,4,1959,114541]
["41960",226,4,1960,111135]
["41961",227,4,1961,104278]
["41962",228,4,1962,100188]
["41963",229,4,1963,98778]
["41964",230,4,1964,98776]
["41965",231,4,1965,99382]
["41966",232,4,1966,102302]
["41967",233,4,1967,104259]
["41968",234,4,1968,105462]
["41969",235,4,1969,107810]
["41970",236,4,1970,109889]
["41971",237,4,1971,112907]
["41972",238,4,1972,116403]
["41973",239,4,1973,119950]
["41974",240,4,1974,123149]
["41975",241,4,1975,126540]
["41976",242,4,1976,130915]
["41977",243,4,1977,135328]
["41978",244,4,1978,138734]
["41979",245,4,1979,141643]
["41980",246,4,1980,143838]
["41981",247,4,1981,145051]
["41982",248,4,1982,144476]
["41983",249,4,1983,142367]
["41984",250,4,1984,139573]
["41985",251,4,1985,135569]
["41986",252,4,1986,131136]
["41987",253,4,1987,126556]
["41988",254,4,1988,121314]
["41989",255,4,1989,116350]
["41990",256,4,1990,112513]
["41991",257,4,1991,109549]
["41992",258,4,1992,106887]
["41993",259,4,1993,104197]
["41994",260,4,1994,102014]
["41995",261,4,1995,100698]
["41996",262,4,1996,100596]
["41997",263,4,1997,102112]
["41998",264,4,1998,104041]
["41999",265,4,1999,105706]
["42000",266,4,2000,107037]
["42001",267,4,2001,107445]
["42002",268,4,2002,107288]
["42003",269,4,2003,107089]
["42004",270,4,2004,107455]
["42005",271,4,2005,107923]
["42006",272,4,2006,108369]
["42007",273,4,2007,109216]
["42008",274,4,2008,109968]
["42009",275,4,2009,109921]
["42010",276,4,2010,108831]
["42011",277,4,2011,107516]
["42012",278,4,2012,106119]
["42013",279,4,2013,103667]
[{"$f":"C280&D280","v":"42014"},280,4,2014,100972]
["42015",281,4,2015,99084]
["42016",282,4,2016,98404]
["42017",283,4,2017,96136]
["42018",284,4,2018,93931]
["42019",285,4,2019,92452]
["42020",286,4,2020,91766]
["42021",287,4,2021,91300]
["42022",288,4,2022,92201]
["42023",289,4,2023,92493]
["51952",290,5,1952,25742]
["51953",291,5,1953,25311]
["51954",292,5,1954,26517]
["51955",293,5,1955,29164]
["51956",294,5,1956,31896]
["51957",295,5,1957,34174]
["51958",296,5,1958,36041]
["51959",297,5,1959,37623]
["51960",298,5,1960,37142]
["51961",299,5,1961,35424]
["51962",300,5,1962,34572]
["51963",301,5,1963,34219]
["51964",302,5,1964,34111]
["51965",303,5,1965,33952]
["51966",304,5,1966,34501]
["51967",305,5,1967,35163]
["51968",306,5,1968,34956]
["51969",307,5,1969,34782]
["51970",308,5,1970,35008]
["51971",309,5,1971,35835]
["51972",310,5,1972,37173]
["51973",311,5,1973,38380]
["51974",312,5,1974,39333]
["51975",313,5,1975,40422]
["51976",314,5,1976,42058]
["51977",315,5,1977,43666]
["51978",316,5,1978,44978]
["51979",317,5,1979,46276]
["51980",318,5,1980,47398]
["51981",319,5,1981,48215]
["51982",320,5,1982,48543]
["51983",321,5,1983,48721]
["51984",322,5,1984,48565]
["51985",323,5,1985,47835]
["51986",324,5,1986,46880]
["51987",325,5,1987,45781]
["51988",326,5,1988,44413]
["51989",327,5,1989,43017]
["51990",328,5,1990,42321]
["51991",329,5,1991,41592]
["51992",330,5,1992,40657]
["51993",331,5,1993,39776]
["51994",332,5,1994,38869]
["51995",333,5,1995,38367]
["51996",334,5,1996,38265]
["51997",335,5,1997,38533]
["51998",336,5,1998,38881]
[{"$f":"C337&D337","v":"51999"},337,5,1999,39166]
["52000",338,5,2000,39482]
["52001",339,5,2001,39623]
["52002",340,5,2002,39366]
["52003",341,5,2003,39180]
["52004",342,5,2004,39181]
["52005",343,5,2005,38893]
["52006",344,5,2006,38927]
["52007",345,5,2007,39080]
["52008",346,5,2008,39303]
["52009",347,5,2009,39259]
["52010",348,5,2010,39027]
["52011",349,5,2011,38744]
["52012",350,5,2012,38405]
["52013",351,5,2013,37790]
["52014",352,5,2014,37134]
["52015",353,5,2015,36966]
["52016",354,5,2016,37059]
["52017",355,5,2017,36368]
["52018",356,5,2018,35475]
["52019",357,5,2019,34636]
["52020",358,5,2020,34223]
["52021",359,5,2021,33732]
["52022",360,5,2022,33835]
["52023",361,5,2023,33929]
["61952",362,6,1952,88145]
["61953",363,6,1953,86310]
["61954",364,6,1954,89448]
["61955",365,6,1955,96686]
["61956",366,6,1956,103410]
["61957",367,6,1957,108464]
["61958",368,6,1958,112190]
["61959",369,6,1959,114883]
["61960",370,6,1960,112304]
["61961",371,6,1961,105844]
["61962",372,6,1962,101796]
["61963",373,6,1963,100551]
["61964",374,6,1964,100427]
["61965",375,6,1965,100408]
["61966",376,6,1966,102232]
["61967",377,6,1967,104352]
["61968",378,6,1968,104276]
["61969",379,6,1969,103966]
["61970",380,6,1970,105046]
["61971",381,6,1971,107198]
["61972",382,6,1972,109937]
["61973",383,6,1973,113008]
["61974",384,6,1974,116002]
["61975",385,6,1975,118781]
["61976",386,6,1976,121885]
["61977",387,6,1977,124721]
["61978",388,6,1978,126863]
["61979",389,6,1979,128975]
["61980",390,6,1980,130103]
["61981",391,6,1981,130629]
["61982",392,6,1982,130034]
["61983",393,6,1983,128150]
[{"$f":"C394&D394","v":"61984"},394,6,1984,125702]
["61985",395,6,1985,122117]
["61986",396,6,1986,118303]
["61987",397,6,1987,114428]
["61988",398,6,1988,109899]
["61989",399,6,1989,104869]
["61990",400,6,1990,100103]
["61991",401,6,1991,96060]
["61992",402,6,1992,92709]
["61993",403,6,1993,89485]
["61994",404,6,1994,86965]
["61995",405,6,1995,85879]
["61996",406,6,1996,85634]
["61997",407,6,1997,86047]
["61998",408,6,1998,86632]
["61999",409,6,1999,87057]
["62000",410,6,2000,87380]
["62001",411,6,2001,87245]
["62002",412,6,2002,86640]
["62003",413,6,2003,85871]
["62004",414,6,2004,85504]
["62005",415,6,2005,85445]
["62006",416,6,2006,85615]
["62007",417,6,2007,85959]
["62008",418,6,2008,86173]
["62009",419,6,2009,85965]
["62010",420,6,2010,85203]
["62011",421,6,2011,84226]
["62012",422,6,2012,83111]
["62013",423,6,2013,81065]
["62014",424,6,2014,78949]
["62015",425,6,2015,77683]
["62016",426,6,2016,77239]
["62017",427,6,2017,74673]
["62018",428,6,2018,72359]
["62019",429,6,2019,70980]
["62020",430,6,2020,70033]
["62021",431,6,2021,69526]
["62022",432,6,2022,70411]
["62023",433,6,2023,70860]
["71952",434,7,1952,37130]
["71953",435,7,1953,37029]
["71954",436,7,1954,38421]
["71955",437,7,1955,41297]
["71956",438,7,1956,44634]
["71957",439,7,1957,47355]
["71958",440,7,1958,49162]
["71959",441,7,1959,50380]
["71960",442,7,1960,49203]
["71961",443,7,1961,46972]
["71962",444,7,1962,45786]
["71963",445,7,1963,45509]
["71964",446,7,1964,45856]
["71965",447,7,1965,46152]
["71966",448,7,1966,47459]
["71967",449,7,1967,48764]
["71968",450,7,1968,48900]
[{"$f":"C451&D451","v":"71969"},451,7,1969,48596]
["71970",452,7,1970,48532]
["71971",453,7,1971,49192]
["71972",454,7,1972,50528]
["71973",455,7,1973,52357]
["71974",456,7,1974,54546]
["71975",457,7,1975,56869]
["71976",458,7,1976,59615]
["71977",459,7,1977,62502]
["71978",460,7,1978,64573]
["71979",461,7,1979,66315]
["71980",462,7,1980,67885]
["71981",463,7,1981,68843]
["71982",464,7,1982,69052]
["71983",465,7,1983,68955]
["71984",466,7,1984,68652]
["71985",467,7,1985,67459]
["71986",468,7,1986,65713]
["71987",469,7,1987,63641]
["71988",470,7,1988,61042]
["71989",471,7,1989,58412]
["71990",472,7,1990,56007]
["71991",473,7,1991,54076]
["71992",474,7,1992,52548]
["71993",475,7,1993,51041]
["71994",476,7,1994,49948]
["71995",477,7,1995,49463]
["71996",478,7,1996,49493]
["71997",479,7,1997,49879]
["71998",480,7,1998,50479]
["71999",481,7,1999,51101]
["72000",482,7,2000,51581]
["72001",483,7,2001,51899]
["72002",484,7,2002,51709]
["72003",485,7,2003,51548]
["72004",486,7,2004,51725]
["72005",487,7,2005,51965]
["72006",488,7,2006,52347]
["72007",489,7,2007,52899]
["72008",490,7,2008,53594]
["72009",491,7,2009,53763]
["72010",492,7,2010,53521]
["72011",493,7,2011,53303]
["72012",494,7,2012,53192]
["72013",495,7,2013,52428]
["72014",496,7,2014,51232]
["72015",497,7,2015,50331]
["72016",498,7,2016,49729]
["72017",499,7,2017,48247]
["72018",500,7,2018,46680]
["72019",501,7,2019,45790]
["72020",502,7,2020,45169]
["72021",503,7,2021,44766]
["72022",504,7,2022,45054]
["72023",505,7,2023,45327]
["81952",506,8,1952,17843]
["81953",507,8,1953,17885]
[{"$f":"C508&D508","v":"81954"},508,8,1954,18724]
["81955",509,8,1955,20361]
["81956",510,8,1956,22013]
["81957",511,8,1957,23488]
["81958",512,8,1958,24801]
["81959",513,8,1959,25780]
["81960",514,8,1960,25384]
["81961",515,8,1961,24062]
["81962",516,8,1962,23095]
["81963",517,8,1963,22546]
["81964",518,8,1964,22308]
["81965",519,8,1965,22394]
["81966",520,8,1966,23156]
["81967",521,8,1967,23815]
["81968",522,8,1968,24052]
["81969",523,8,1969,24561]
["81970",524,8,1970,25376]
["81971",525,8,1971,26250]
["81972",526,8,1972,27260]
["81973",527,8,1973,28280]
["81974",528,8,1974,29010]
["81975",529,8,1975,29737]
["81976",530,8,1976,30807]
["81977",531,8,1977,32108]
["81978",532,8,1978,33325]
["81979",533,8,1979,34396]
["81980",534,8,1980,35207]
["81981",535,8,1981,35756]
["81982",536,8,1982,35821]
["81983",537,8,1983,35504]
["81984",538,8,1984,35149]
["81985",539,8,1985,34483]
["81986",540,8,1986,33655]
["81987",541,8,1987,32757]
[{"$f":"C542&D542","v":"81988"},542,8,1988,31837]
["81989",543,8,1989,31419]
["81990",544,8,1990,31095]
["81991",545,8,1991,30583]
["81992",546,8,1992,29956]
["81993",547,8,1993,29040]
["81994",548,8,1994,28130]
["81995",549,8,1995,27685]
["81996",550,8,1996,27603]
["81997",551,8,1997,27749]
[{"$f":"C552&D552","v":"81998"},552,8,1998,28002]
["81999",553,8,1999,28214]
["82000",554,8,2000,28478]
["82001",555,8,2001,28536]
["82002",556,8,2002,28413]
["82003",557,8,2003,28170]
["82004",558,8,2004,28236]
["82005",559,8,2005,28320]
["82006",560,8,2006,28434]
["82007",561,8,2007,28658]
[{"$f":"C562&D562","v":"82008"},562,8,2008,28976]
["82009",563,8,2009,29157]
["82010",564,8,2010,29066]
["82011",565,8,2011,29032]
["82012",566,8,2012,28868]
["82013",567,8,2013,28398]
["82014",568,8,2014,27693]
["82015",569,8,2015,27380]
["82016",570,8,2016,27355]
["82017",571,8,2017,26990]
["82018",572,8,2018,26418]
["82019",573,8,2019,26009]
["82020",574,8,2020,25851]
["82021",575,8,2021,25709]
["82022",576,8,2022,25982]
["82023",577,8,2023,26056]
["91952",578,9,1952,72526]
["91953",579,9,1953,69717]
["91954",580,9,1954,75731]
["91955",581,9,1955,91202]
["91956",582,9,1956,109277]
["91957",583,9,1957,124637]
["91958",584,9,1958,138318]
["91959",585,9,1959,151165]
["91960",586,9,1960,152214]
["91961",587,9,1961,141285]
["91962",588,9,1962,132213]
["91963",589,9,1963,127693]
["91964",590,9,1964,121638]
["91965",591,9,1965,113013]
["91966",592,9,1966,106867]
["91967",593,9,1967,104146]
["91968",594,9,1968,98498]
["91969",595,9,1969,90683]
["91970",596,9,1970,85911]
["91971",597,9,1971,84882]
["91972",598,9,1972,87574]
["91973",599,9,1973,92201]
["91974",600,9,1974,96400]
["91975",601,9,1975,100380]
["91976",602,9,1976,105108]
["91977",603,9,1977,109968]
["91978",604,9,1978,113825]
["91979",605,9,1979,116737]
["91980",606,9,1980,119547]
["91981",607,9,1981,122415]
["91982",608,9,1982,124210]
["91983",609,9,1983,125449]
["91984",610,9,1984,126711]
["91985",611,9,1985,126788]
["91986",612,9,1986,124946]
["91987",613,9,1987,120030]
["91988",614,9,1988,113432]
["91989",615,9,1989,107061]
["91990",616,9,1990,100970]
["91991",617,9,1991,96211]
["91992",618,9,1992,93169]
["91993",619,9,1993,91228]
["91994",620,9,1994,89673]
["91995",621,9,1995,88377]
["91996",622,9,1996,87893]
["91997",623,9,1997,88258]
["91998",624,9,1998,89204]
["91999",625,9,1999,90628]
[{"$f":"C626&D626","v":"92000"},626,9,2000,92130]
["92001",627,9,2001,93777]
["92002",628,9,2002,96031]
["92003",629,9,2003,98823]
["92004",630,9,2004,101345]
["92005",631,9,2005,103526]
["92006",632,9,2006,104652]
["92007",633,9,2007,105955]
["92008",634,9,2008,107116]
["92009",635,9,2009,108050]
["92010",636,9,2010,108654]
["92011",637,9,2011,108505]
["92012",638,9,2012,108766]
["92013",639,9,2013,109182]
["92014",640,9,2014,108998]
["92015",641,9,2015,109867]
["92016",642,9,2016,112584]
["92017",643,9,2017,113383]
["92018",644,9,2018,112577]
["92019",645,9,2019,112089]
["92020",646,9,2020,112236]
["92021",647,9,2021,112614]
["92022",648,9,2022,116820]
["92023",649,9,2023,120199]
["101952",650,10,1952,516579]
["101953",651,10,1953,507131]
[{"$f":"C652&D652","v":"101954"},652,10,1954,526285]
["101955",653,10,1955,572273]
["101956",654,10,1956,618417]
["101957",655,10,1957,652561]
["101958",656,10,1958,678959]
["101959",657,10,1959,701022]
["101960",658,10,1960,685570]
["101961",659,10,1961,640049]
[{"$f":"C660&D660","v":"101962"},660,10,1962,610962]
["101963",661,10,1963,602714]
["101964",662,10,1964,598991]
["101965",663,10,1965,592947]
["101966",664,10,1966,599612]
["101967",665,10,1967,611022]
["101968",666,10,1968,608736]
["101969",667,10,1969,602219]
["101970",668,10,1970,603625]
["101971",669,10,1971,614551]
["101972",670,10,1972,632283]
["101973",671,10,1973,652346]
[{"$f":"C672&D672","v":"101974"},672,10,1974,670477]
["101975",673,10,1975,688653]
["101976",674,10,1976,711523]
["101977",675,10,1977,734943]
["101978",676,10,1978,753282]
["101979",677,10,1979,769221]
["101980",678,10,1980,781590]
["101981",679,10,1981,789740]
["101982",680,10,1982,789886]
["101983",681,10,1983,783204]
[{"$f":"C682&D682","v":"101984"},682,10,1984,773598]
["101985",683,10,1985,757293]
["101986",684,10,1986,737187]
["101987",685,10,1987,713404]
["101988",686,10,1988,684945]
["101989",687,10,1989,657474]
["101990",688,10,1990,633747]
["101991",689,10,1991,613287]
["101992",690,10,1992,595823]
["101993",691,10,1993,579081]
[{"$f":"C692&D692","v":"101994"},692,10,1994,564953]
["101995",693,10,1995,557133]
["101996",694,10,1996,555618]
["101997",695,10,1997,559876]
["101998",696,10,1998,566692]
["101999",697,10,1999,573778]
["102000",698,10,2000,579865]
["102001",699,10,2001,582577]
["102002",700,10,2002,582323]
["102003",701,10,2003,582622]
[{"$f":"C702&D702","v":"102004"},702,10,2004,585431]
["102005",703,10,2005,589082]
["102006",704,10,2006,592736]
["102007",705,10,2007,597484]
["102008",706,10,2008,602129]
["102009",707,10,2009,603465]
["102010",708,10,2010,600243]
["102011",709,10,2011,595488]
["102012",710,10,2012,589728]
["102013",711,10,2013,579996]
[{"$f":"C712&D712","v":"102014"},712,10,2014,568742]
["102015",713,10,2015,562527]
["102016",714,10,2016,562931]
["102017",715,10,2017,552541]
["102018",716,10,2018,540784]
["102019",717,10,2019,533268]
["102020",718,10,2020,529701]
["102021",719,10,2021,527954]
["102022",720,10,2022,536461]
["102023",721,10,2023,541590]

{"sheet":"Bev_15_20_Auswahl","index":4,"n_rows":64,"n_cols":7,"rows_kept":64,"cut":false,"hidden":true,"merged":[]}
["Zeilenindex",null,"Bev_15_20","Bevölkerungspunkte","Max_Jahr",{"$f":"MAX(B:B)","v":2023},"Beschriftung_Bevölkerungslinie"]
[{"$f":"VLOOKUP(Bundesland&Bev_15_20_Auswahl!$B2,Bev_15_20_Matrix,2,FALSE)","v":659},1961,{"$f":"IF(Graph1Title=\"Insgesamt\",IF(ISERROR($A2),0,IF(INDEX(Bev_15_20_Matrix,$A2,5)=0,\".\",INDEX(Bev_15_20_Matrix,$A2,5))),NA())","v":640049},{"$f":"IF(RIGHT(B2,1)=\"0\",C2,IF(B2=Max_Jahr,C2,NA()))","v":{"$error":"#N/A"}},null,null,{"$f":"IF(Graph1Title=\"Insgesamt\",\"Bevölkerung der Altersgruppe 15-20 Jahre\",\"\")","v":"Bevölkerung der Altersgruppe 15-20 Jahre"}]
[{"$f":"VLOOKUP(Bundesland&Bev_15_20_Auswahl!$B3,Bev_15_20_Matrix,2,FALSE)","v":660},1962,610962,{"$error":"#N/A"}]
[{"$f":"VLOOKUP(Bundesland&Bev_15_20_Auswahl!$B4,Bev_15_20_Matrix,2,FALSE)","v":661},1963,602714,{"$error":"#N/A"}]
[{"$f":"VLOOKUP(Bundesland&Bev_15_20_Auswahl!$B5,Bev_15_20_Matrix,2,FALSE)","v":662},1964,598991,{"$error":"#N/A"}]
[{"$f":"VLOOKUP(Bundesland&Bev_15_20_Auswahl!$B6,Bev_15_20_Matrix,2,FALSE)","v":663},1965,592947,{"$error":"#N/A"}]
[{"$f":"VLOOKUP(Bundesland&Bev_15_20_Auswahl!$B7,Bev_15_20_Matrix,2,FALSE)","v":664},1966,599612,{"$error":"#N/A"}]
[{"$f":"VLOOKUP(Bundesland&Bev_15_20_Auswahl!$B8,Bev_15_20_Matrix,2,FALSE)","v":665},1967,611022,{"$error":"#N/A"}]
[{"$f":"VLOOKUP(Bundesland&Bev_15_20_Auswahl!$B9,Bev_15_20_Matrix,2,FALSE)","v":666},1968,608736,{"$error":"#N/A"}]
[{"$f":"VLOOKUP(Bundesland&Bev_15_20_Auswahl!$B10,Bev_15_20_Matrix,2,FALSE)","v":667},1969,602219,{"$error":"#N/A"}]
[{"$f":"VLOOKUP(Bundesland&Bev_15_20_Auswahl!$B11,Bev_15_20_Matrix,2,FALSE)","v":668},1970,603625,603625]
[{"$f":"VLOOKUP(Bundesland&Bev_15_20_Auswahl!$B12,Bev_15_20_Matrix,2,FALSE)","v":669},1971,614551,{"$error":"#N/A"}]
[{"$f":"VLOOKUP(Bundesland&Bev_15_20_Auswahl!$B13,Bev_15_20_Matrix,2,FALSE)","v":670},1972,632283,{"$error":"#N/A"}]
[{"$f":"VLOOKUP(Bundesland&Bev_15_20_Auswahl!$B14,Bev_15_20_Matrix,2,FALSE)","v":671},1973,652346,{"$error":"#N/A"}]
[{"$f":"VLOOKUP(Bundesland&Bev_15_20_Auswahl!$B15,Bev_15_20_Matrix,2,FALSE)","v":672},1974,670477,{"$error":"#N/A"}]
[{"$f":"VLOOKUP(Bundesland&Bev_15_20_Auswahl!$B16,Bev_15_20_Matrix,2,FALSE)","v":673},1975,688653,{"$error":"#N/A"}]
[{"$f":"VLOOKUP(Bundesland&Bev_15_20_Auswahl!$B17,Bev_15_20_Matrix,2,FALSE)","v":674},1976,711523,{"$error":"#N/A"}]
[{"$f":"VLOOKUP(Bundesland&Bev_15_20_Auswahl!$B18,Bev_15_20_Matrix,2,FALSE)","v":675},1977,734943,{"$error":"#N/A"}]
[{"$f":"VLOOKUP(Bundesland&Bev_15_20_Auswahl!$B19,Bev_15_20_Matrix,2,FALSE)","v":676},1978,753282,{"$error":"#N/A"}]
[{"$f":"VLOOKUP(Bundesland&Bev_15_20_Auswahl!$B20,Bev_15_20_Matrix,2,FALSE)","v":677},1979,769221,{"$error":"#N/A"}]
[{"$f":"VLOOKUP(Bundesland&Bev_15_20_Auswahl!$B21,Bev_15_20_Matrix,2,FALSE)","v":678},1980,781590,781590]
[{"$f":"VLOOKUP(Bundesland&Bev_15_20_Auswahl!$B22,Bev_15_20_Matrix,2,FALSE)","v":679},1981,789740,{"$error":"#N/A"}]
[{"$f":"VLOOKUP(Bundesland&Bev_15_20_Auswahl!$B23,Bev_15_20_Matrix,2,FALSE)","v":680},1982,789886,{"$error":"#N/A"}]
[{"$f":"VLOOKUP(Bundesland&Bev_15_20_Auswahl!$B24,Bev_15_20_Matrix,2,FALSE)","v":681},1983,783204,{"$error":"#N/A"}]
[{"$f":"VLOOKUP(Bundesland&Bev_15_20_Auswahl!$B25,Bev_15_20_Matrix,2,FALSE)","v":682},1984,773598,{"$error":"#N/A"}]
[{"$f":"VLOOKUP(Bundesland&Bev_15_20_Auswahl!$B26,Bev_15_20_Matrix,2,FALSE)","v":683},1985,757293,{"$error":"#N/A"}]
[{"$f":"VLOOKUP(Bundesland&Bev_15_20_Auswahl!$B27,Bev_15_20_Matrix,2,FALSE)","v":684},1986,{"$f":"IF(Graph1Title=\"Insgesamt\",IF(ISERROR($A27),0,IF(INDEX(Bev_15_20_Matrix,$A27,5)=0,\".\",INDEX(Bev_15_20_Matrix,$A27,5))),NA())","v":737187},{"$f":"IF(RIGHT(B27,1)=\"0\",C27,IF(B27=Max_Jahr,C27,NA()))","v":{"$error":"#N/A"}}]
[{"$f":"VLOOKUP(Bundesland&Bev_15_20_Auswahl!$B28,Bev_15_20_Matrix,2,FALSE)","v":685},1987,713404,{"$error":"#N/A"}]
[{"$f":"VLOOKUP(Bundesland&Bev_15_20_Auswahl!$B29,Bev_15_20_Matrix,2,FALSE)","v":686},1988,684945,{"$error":"#N/A"}]
[{"$f":"VLOOKUP(Bundesland&Bev_15_20_Auswahl!$B30,Bev_15_20_Matrix,2,FALSE)","v":687},1989,657474,{"$error":"#N/A"}]
[{"$f":"VLOOKUP(Bundesland&Bev_15_20_Auswahl!$B31,Bev_15_20_Matrix,2,FALSE)","v":688},1990,633747,633747]
[{"$f":"VLOOKUP(Bundesland&Bev_15_20_Auswahl!$B32,Bev_15_20_Matrix,2,FALSE)","v":689},1991,613287,{"$error":"#N/A"}]
[{"$f":"VLOOKUP(Bundesland&Bev_15_20_Auswahl!$B33,Bev_15_20_Matrix,2,FALSE)","v":690},1992,595823,{"$error":"#N/A"}]
[{"$f":"VLOOKUP(Bundesland&Bev_15_20_Auswahl!$B34,Bev_15_20_Matrix,2,FALSE)","v":691},1993,579081,{"$error":"#N/A"}]
[{"$f":"VLOOKUP(Bundesland&Bev_15_20_Auswahl!$B35,Bev_15_20_Matrix,2,FALSE)","v":692},1994,564953,{"$error":"#N/A"}]
[{"$f":"VLOOKUP(Bundesland&Bev_15_20_Auswahl!$B36,Bev_15_20_Matrix,2,FALSE)","v":693},1995,557133,{"$error":"#N/A"}]
[{"$f":"VLOOKUP(Bundesland&Bev_15_20_Auswahl!$B37,Bev_15_20_Matrix,2,FALSE)","v":694},1996,555618,{"$error":"#N/A"}]
[{"$f":"VLOOKUP(Bundesland&Bev_15_20_Auswahl!$B38,Bev_15_20_Matrix,2,FALSE)","v":695},1997,559876,{"$error":"#N/A"}]
[{"$f":"VLOOKUP(Bundesland&Bev_15_20_Auswahl!$B39,Bev_15_20_Matrix,2,FALSE)","v":696},1998,566692,{"$error":"#N/A"}]
[{"$f":"VLOOKUP(Bundesland&Bev_15_20_Auswahl!$B40,Bev_15_20_Matrix,2,FALSE)","v":697},1999,573778,{"$error":"#N/A"}]
[{"$f":"VLOOKUP(Bundesland&Bev_15_20_Auswahl!$B41,Bev_15_20_Matrix,2,FALSE)","v":698},2000,579865,579865]
[{"$f":"VLOOKUP(Bundesland&Bev_15_20_Auswahl!$B42,Bev_15_20_Matrix,2,FALSE)","v":699},2001,582577,{"$error":"#N/A"}]
[{"$f":"VLOOKUP(Bundesland&Bev_15_20_Auswahl!$B43,Bev_15_20_Matrix,2,FALSE)","v":700},2002,582323,{"$error":"#N/A"}]
[{"$f":"VLOOKUP(Bundesland&Bev_15_20_Auswahl!$B44,Bev_15_20_Matrix,2,FALSE)","v":701},2003,582622,{"$error":"#N/A"}]
[{"$f":"VLOOKUP(Bundesland&Bev_15_20_Auswahl!$B45,Bev_15_20_Matrix,2,FALSE)","v":702},2004,585431,{"$error":"#N/A"}]
[{"$f":"VLOOKUP(Bundesland&Bev_15_20_Auswahl!$B46,Bev_15_20_Matrix,2,FALSE)","v":703},2005,589082,{"$error":"#N/A"}]
[{"$f":"VLOOKUP(Bundesland&Bev_15_20_Auswahl!$B47,Bev_15_20_Matrix,2,FALSE)","v":704},2006,592736,{"$error":"#N/A"}]
[{"$f":"VLOOKUP(Bundesland&Bev_15_20_Auswahl!$B48,Bev_15_20_Matrix,2,FALSE)","v":705},2007,597484,{"$error":"#N/A"}]
[{"$f":"VLOOKUP(Bundesland&Bev_15_20_Auswahl!$B49,Bev_15_20_Matrix,2,FALSE)","v":706},2008,602129,{"$error":"#N/A"}]
[{"$f":"VLOOKUP(Bundesland&Bev_15_20_Auswahl!$B50,Bev_15_20_Matrix,2,FALSE)","v":707},2009,603465,{"$error":"#N/A"}]
[{"$f":"VLOOKUP(Bundesland&Bev_15_20_Auswahl!$B51,Bev_15_20_Matrix,2,FALSE)","v":708},2010,600243,600243]
[{"$f":"VLOOKUP(Bundesland&Bev_15_20_Auswahl!$B52,Bev_15_20_Matrix,2,FALSE)","v":709},2011,595488,{"$error":"#N/A"}]
[{"$f":"VLOOKUP(Bundesland&Bev_15_20_Auswahl!$B53,Bev_15_20_Matrix,2,FALSE)","v":710},2012,589728,{"$error":"#N/A"}]
[{"$f":"VLOOKUP(Bundesland&Bev_15_20_Auswahl!$B54,Bev_15_20_Matrix,2,FALSE)","v":711},2013,579996,{"$error":"#N/A"}]
[{"$f":"VLOOKUP(Bundesland&Bev_15_20_Auswahl!$B55,Bev_15_20_Matrix,2,FALSE)","v":712},2014,568742,{"$error":"#N/A"}]
[{"$f":"VLOOKUP(Bundesland&Bev_15_20_Auswahl!$B56,Bev_15_20_Matrix,2,FALSE)","v":713},2015,562527,{"$error":"#N/A"}]
[{"$f":"VLOOKUP(Bundesland&Bev_15_20_Auswahl!$B57,Bev_15_20_Matrix,2,FALSE)","v":714},2016,562931,{"$f":"IF(RIGHT(B57,1)=\"0\",C57,IF(B57=Max_Jahr,C57,NA()))","v":{"$error":"#N/A"}}]
[{"$f":"VLOOKUP(Bundesland&Bev_15_20_Auswahl!$B58,Bev_15_20_Matrix,2,FALSE)","v":715},2017,552541,{"$error":"#N/A"}]
[{"$f":"VLOOKUP(Bundesland&Bev_15_20_Auswahl!$B59,Bev_15_20_Matrix,2,FALSE)","v":716},2018,540784,{"$f":"IF(RIGHT(B59,1)=\"0\",C59,IF(B59=Max_Jahr,C59,NA()))","v":{"$error":"#N/A"}}]
[{"$f":"VLOOKUP(Bundesland&Bev_15_20_Auswahl!$B60,Bev_15_20_Matrix,2,FALSE)","v":717},2019,533268,{"$f":"IF(RIGHT(B60,1)=\"0\",C60,IF(B60=Max_Jahr,C60,NA()))","v":{"$error":"#N/A"}}]
[{"$f":"VLOOKUP(Bundesland&Bev_15_20_Auswahl!$B61,Bev_15_20_Matrix,2,FALSE)","v":718},2020,529701,{"$f":"IF(RIGHT(B61,1)=\"0\",C61,IF(B61=Max_Jahr,C61,NA()))","v":529701}]
[{"$f":"VLOOKUP(Bundesland&Bev_15_20_Auswahl!$B62,Bev_15_20_Matrix,2,FALSE)","v":719},2021,527954,{"$f":"IF(RIGHT(B62,1)=\"0\",C62,IF(B62=Max_Jahr,C62,NA()))","v":{"$error":"#N/A"}}]
[{"$f":"VLOOKUP(Bundesland&Bev_15_20_Auswahl!$B63,Bev_15_20_Matrix,2,FALSE)","v":720},2022,536461,{"$f":"IF(RIGHT(B63,1)=\"0\",C63,IF(B63=Max_Jahr,C63,NA()))","v":{"$error":"#N/A"}}]
[{"$f":"VLOOKUP(Bundesland&Bev_15_20_Auswahl!$B64,Bev_15_20_Matrix,2,FALSE)","v":721},2023,541590,541590]

{"sheet":"Wappen","index":5,"n_rows":10,"n_cols":8,"rows_kept":10,"cut":false,"hidden":true,"merged":[]}
[null,"Burgenland",1,{"$f":"Auswahl_Bundesland","v":"ÖSTERREICH"},{"$f":"LOOKUP(D1,B1:B10,C1:C10)","v":5},null,null,{"$f":"INDIRECT(\"$A$\"&E1)","v":0}]
[null,"Kärnten",2]
[null,"Niederösterreich",3]
[null,"Oberösterreich",4]
[null,"Österreich",5]
[null,"Salzburg",6]
[null,"Steiermark",7]
[null,"Tirol",8]
[null,"Vorarlberg",9]
[null,"Wien",10]

{"sheet":"Stage","index":6,"n_rows":81,"n_cols":9,"rows_kept":81,"cut":false,"hidden":true,"merged":[]}
[]
[null,"Scrollbar",56]
[null,"OptionButtons",1,{"$f":"IF(OptionButton=1,0,11)","v":0}]
[null,"OnClick",null,{"$f":"SUBSTITUTE(SUBSTITUTE(OnClick,\" 2\",),\" \",)","v":""}]
[]
[null,"Dropdown-Bundesland"]
[null,null,null,null,"Auswahl","Auswahl_Bundesland",null,null,"Beschriftung der Bevölkerungsentwicklung der 15-20-Jährigen"]
[null,1,"BURGENLAND",null,10,{"$f":"LOOKUP(E8,B8:C17)","v":"ÖSTERREICH"},null,null,{"$f":"IF(Graph1Title=\"Insgesamt\",\"Bevölkerung der Altersgruppe 15-20 Jahre\",\"\")","v":"Bevölkerung der Altersgruppe 15-20 Jahre"}]
[null,2,"KÄRNTEN",null,null,null,null,null,{"$f":"IF(Graph1Title=\"Insgesamt\",\"Bevölkerung der Altersgruppe 15-20 Jahre zum Jahr\",\"\")","v":"Bevölkerung der Altersgruppe 15-20 Jahre zum Jahr"}]
[null,3,"NIEDERÖSTERREICH"]
[null,4,"OBERÖSTERREICH"]
[null,5,"SALZBURG"]
[null,6,"STEIERMARK"]
[null,7,"TIROL"]
[null,8,"VORARLBERG"]
[null,9,"WIEN"]
[null,10,"ÖSTERREICH"]
[]
[null,1961,1,"Maximalwert",{"$f":"MAX(C19:C1000)","v":63}]
[null,1962,2]
[null,1963,3]
[null,1964,4]
[null,1965,5]
[null,1966,6]
[null,1967,7]
[null,1968,8]
[null,1969,9]
[null,1970,10]
[null,1971,11]
[null,1972,12]
[null,1973,13]
[null,1974,14]
[null,1975,15]
[null,1976,16]
[null,1977,17]
[null,1978,18]
[null,1979,19]
[null,1980,20]
[null,1981,21]
[null,1982,22]
[null,1983,23]
[null,1984,24]
[null,1985,25]
[null,1986,26]
[null,1987,27]
[null,1988,28]
[null,1989,29]
[null,1990,30]
[null,1991,31]
[null,1992,32]
[null,1993,33]
[null,1994,34]
[null,1995,35]
[null,1996,36]
[null,1997,37]
[null,1998,38]
[null,1999,39]
[null,2000,40]
[null,2001,41]
[null,2002,42]
[null,2003,43]
[null,2004,44]
[null,2005,45]
[null,2006,46]
[null,2007,47]
[null,2008,48]
[null,2009,49]
[null,2010,50]
[null,2011,51]
[null,2012,52]
[null,2013,53]
[null,2014,54]
[null,2015,55]
[null,2016,56]
[null,2017,57]
[null,2018,58]
[null,2019,59]
[null,2020,60]
[null,2021,61]
[null,2022,62]
[null,2023,63]