{"text_format":"1","workbook":"xlsx","n_sheets":7,"sheets":["Dashboard","Daten","Daten_Auswahl","Bev_15_20","Bev_15_20_Auswahl","Wappen","Stage"],"not_rendered":{"charts":2,"images":19,"macros":1,"external_links":0,"defined_names":57,"comments":0,"pivot_tables":0},"unopened":[],"bounds":{"document_bytes":16777216,"sheet_cells":100000,"rows_first":2000,"rows_last":500,"rows_between":2000,"halvings":0,"cell_chars":16384,"cell_head_chars":4096},"cells_cut":0,"cells_raw":0,"read":"whole","date_system":"1900"}

{"sheet":"Dashboard","index":0,"n_rows":30,"n_cols":13,"rows_kept":30,"cut":false,"hidden":false,"merged":[]}
[]
[null,"Lehrlinge nach Bundesländern und Sparten, Stichtag 31. Dezember 1"]
[null,"Quelle: Lehrlingsstatistik, Wirtschaftskammern Österreichs, Statistik"]
[null,"Auswahl:"]
[null,{"$f":"Auswahl_Bundesland","v":"ÖSTERREICH"}]
[]
[null,"Jahr",null,"Insgesamt","Gewerbe und Handwerk","Industrie","Handel","Bank und Versicherung","Transport und Verkehr","Tourismus und Freizeitwirtschaft","Information und Consulting","Sonstige Lehrberechtigte","Überbetriebliche Lehrausbildung 2"]
[null,{"$f":"OFFSET(Daten_Auswahl!B8,Scrollbar,0)","v":2016},null,{"$f":"OFFSET(Daten_Auswahl!L8,Scrollbar,OptionButtonMultiplier)","v":106950},{"$f":"OFFSET(Daten_Auswahl!C8,Scrollbar,OptionButtonMultiplier)","v":44909},{"$f":"OFFSET(Daten_Auswahl!D8,Scrollbar,OptionButtonMultiplier)","v":15079},{"$f":"OFFSET(Daten_Auswahl!E8,Scrollbar,OptionButtonMultiplier)","v":15055},{"$f":"OFFSET(Daten_Auswahl!F8,Scrollbar,OptionButtonMultiplier)","v":1151},{"$f":"OFFSET(Daten_Auswahl!G8,Scrollbar,OptionButtonMultiplier)","v":2648},{"$f":"OFFSET(Daten_Auswahl!H8,Scrollbar,OptionButtonMultiplier)","v":8788},{"$f":"OFFSET(Daten_Auswahl!I8,Scrollbar,OptionButtonMultiplier)","v":2143},{"$f":"OFFSET(Daten_Auswahl!J8,Scrollbar,OptionButtonMultiplier)","v":7933},{"$f":"OFFSET(Daten_Auswahl!K8,Scrollbar,OptionButtonMultiplier)","v":9244}]
[null,{"$f":"OFFSET(Daten_Auswahl!B9,Scrollbar,0)","v":2017},null,{"$f":"OFFSET(Daten_Auswahl!L9,Scrollbar,OptionButtonMultiplier)","v":106613},{"$f":"OFFSET(Daten_Auswahl!C9,Scrollbar,OptionButtonMultiplier)","v":44602},{"$f":"OFFSET(Daten_Auswahl!D9,Scrollbar,OptionButtonMultiplier)","v":15159},{"$f":"OFFSET(Daten_Auswahl!E9,Scrollbar,OptionButtonMultiplier)","v":14892},{"$f":"OFFSET(Daten_Auswahl!F9,Scrollbar,OptionButtonMultiplier)","v":1135},{"$f":"OFFSET(Daten_Auswahl!G9,Scrollbar,OptionButtonMultiplier)","v":2753},{"$f":"OFFSET(Daten_Auswahl!H9,Scrollbar,OptionButtonMultiplier)","v":8905},{"$f":"OFFSET(Daten_Auswahl!I9,Scrollbar,OptionButtonMultiplier)","v":2185},{"$f":"OFFSET(Daten_Auswahl!J9,Scrollbar,OptionButtonMultiplier)","v":7881},{"$f":"OFFSET(Daten_Auswahl!K9,Scrollbar,OptionButtonMultiplier)","v":9101}]
[null,{"$f":"OFFSET(Daten_Auswahl!B10,Scrollbar,0)","v":2018},null,{"$f":"OFFSET(Daten_Auswahl!L10,Scrollbar,OptionButtonMultiplier)","v":107915},{"$f":"OFFSET(Daten_Auswahl!C10,Scrollbar,OptionButtonMultiplier)","v":45744},{"$f":"OFFSET(Daten_Auswahl!D10,Scrollbar,OptionButtonMultiplier)","v":15754},{"$f":"OFFSET(Daten_Auswahl!E10,Scrollbar,OptionButtonMultiplier)","v":14957},{"$f":"OFFSET(Daten_Auswahl!F10,Scrollbar,OptionButtonMultiplier)","v":1128},{"$f":"OFFSET(Daten_Auswahl!G10,Scrollbar,OptionButtonMultiplier)","v":2816},{"$f":"OFFSET(Daten_Auswahl!H10,Scrollbar,OptionButtonMultiplier)","v":9048},{"$f":"OFFSET(Daten_Auswahl!I10,Scrollbar,OptionButtonMultiplier)","v":2335},{"$f":"OFFSET(Daten_Auswahl!J10,Scrollbar,OptionButtonMultiplier)","v":7831},{"$f":"OFFSET(Daten_Auswahl!K10,Scrollbar,OptionButtonMultiplier)","v":8302}]
[null,{"$f":"OFFSET(Daten_Auswahl!B11,Scrollbar,0)","v":2019},null,{"$f":"OFFSET(Daten_Auswahl!L11,Scrollbar,OptionButtonMultiplier)","v":109111},{"$f":"OFFSET(Daten_Auswahl!C11,Scrollbar,OptionButtonMultiplier)","v":46390},{"$f":"OFFSET(Daten_Auswahl!D11,Scrollbar,OptionButtonMultiplier)","v":16446},{"$f":"OFFSET(Daten_Auswahl!E11,Scrollbar,OptionButtonMultiplier)","v":15283},{"$f":"OFFSET(Daten_Auswahl!F11,Scrollbar,OptionButtonMultiplier)","v":1222},{"$f":"OFFSET(Daten_Auswahl!G11,Scrollbar,OptionButtonMultiplier)","v":2869},{"$f":"OFFSET(Daten_Auswahl!H11,Scrollbar,OptionButtonMultiplier)","v":8910},{"$f":"OFFSET(Daten_Auswahl!I11,Scrollbar,OptionButtonMultiplier)","v":2509},{"$f":"OFFSET(Daten_Auswahl!J11,Scrollbar,OptionButtonMultiplier)","v":8060},{"$f":"OFFSET(Daten_Auswahl!K11,Scrollbar,OptionButtonMultiplier)","v":7422}]
[null,{"$f":"OFFSET(Daten_Auswahl!B12,Scrollbar,0)","v":2020},null,{"$f":"OFFSET(Daten_Auswahl!L12,Scrollbar,OptionButtonMultiplier)","v":108416},{"$f":"OFFSET(Daten_Auswahl!C12,Scrollbar,OptionButtonMultiplier)","v":46659},{"$f":"OFFSET(Daten_Auswahl!D12,Scrollbar,OptionButtonMultiplier)","v":16389},{"$f":"OFFSET(Daten_Auswahl!E12,Scrollbar,OptionButtonMultiplier)","v":15105},{"$f":"OFFSET(Daten_Auswahl!F12,Scrollbar,OptionButtonMultiplier)","v":1268},{"$f":"OFFSET(Daten_Auswahl!G12,Scrollbar,OptionButtonMultiplier)","v":2786},{"$f":"OFFSET(Daten_Auswahl!H12,Scrollbar,OptionButtonMultiplier)","v":7876},{"$f":"OFFSET(Daten_Auswahl!I12,Scrollbar,OptionButtonMultiplier)","v":2519},{"$f":"OFFSET(Daten_Auswahl!J12,Scrollbar,OptionButtonMultiplier)","v":8574},{"$f":"OFFSET(Daten_Auswahl!K12,Scrollbar,OptionButtonMultiplier)","v":7240}]
[null,{"$f":"OFFSET(Daten_Auswahl!B13,Scrollbar,0)","v":2021},null,{"$f":"OFFSET(Daten_Auswahl!L13,Scrollbar,OptionButtonMultiplier)","v":107593},{"$f":"OFFSET(Daten_Auswahl!C13,Scrollbar,OptionButtonMultiplier)","v":46874},{"$f":"OFFSET(Daten_Auswahl!D13,Scrollbar,OptionButtonMultiplier)","v":16239},{"$f":"OFFSET(Daten_Auswahl!E13,Scrollbar,OptionButtonMultiplier)","v":15149},{"$f":"OFFSET(Daten_Auswahl!F13,Scrollbar,OptionButtonMultiplier)","v":1188},{"$f":"OFFSET(Daten_Auswahl!G13,Scrollbar,OptionButtonMultiplier)","v":2784},{"$f":"OFFSET(Daten_Auswahl!H13,Scrollbar,OptionButtonMultiplier)","v":6914},{"$f":"OFFSET(Daten_Auswahl!I13,Scrollbar,OptionButtonMultiplier)","v":2518},{"$f":"OFFSET(Daten_Auswahl!J13,Scrollbar,OptionButtonMultiplier)","v":9047},{"$f":"OFFSET(Daten_Auswahl!K13,Scrollbar,OptionButtonMultiplier)","v":6880}]
[null,{"$f":"OFFSET(Daten_Auswahl!B14,Scrollbar,0)","v":2022},null,{"$f":"OFFSET(Daten_Auswahl!L14,Scrollbar,OptionButtonMultiplier)","v":108085},{"$f":"OFFSET(Daten_Auswahl!C14,Scrollbar,OptionButtonMultiplier)","v":46913},{"$f":"OFFSET(Daten_Auswahl!D14,Scrollbar,OptionButtonMultiplier)","v":16428},{"$f":"OFFSET(Daten_Auswahl!E14,Scrollbar,OptionButtonMultiplier)","v":15193},{"$f":"OFFSET(Daten_Auswahl!F14,Scrollbar,OptionButtonMultiplier)","v":1218},{"$f":"OFFSET(Daten_Auswahl!G14,Scrollbar,OptionButtonMultiplier)","v":2856},{"$f":"OFFSET(Daten_Auswahl!H14,Scrollbar,OptionButtonMultiplier)","v":6949},{"$f":"OFFSET(Daten_Auswahl!I14,Scrollbar,OptionButtonMultiplier)","v":2764},{"$f":"OFFSET(Daten_Auswahl!J14,Scrollbar,OptionButtonMultiplier)","v":9536},{"$f":"OFFSET(Daten_Auswahl!K14,Scrollbar,OptionButtonMultiplier)","v":6228}]
[null,{"$f":"OFFSET(Daten_Auswahl!B15,Scrollbar,0)","v":2023},null,{"$f":"OFFSET(Daten_Auswahl!L15,Scrollbar,OptionButtonMultiplier)","v":108266},{"$f":"OFFSET(Daten_Auswahl!C15,Scrollbar,OptionButtonMultiplier)","v":46666},{"$f":"OFFSET(Daten_Auswahl!D15,Scrollbar,OptionButtonMultiplier)","v":16804},{"$f":"OFFSET(Daten_Auswahl!E15,Scrollbar,OptionButtonMultiplier)","v":14763},{"$f":"OFFSET(Daten_Auswahl!F15,Scrollbar,OptionButtonMultiplier)","v":1364},{"$f":"OFFSET(Daten_Auswahl!G15,Scrollbar,OptionButtonMultiplier)","v":2981},{"$f":"OFFSET(Daten_Auswahl!H15,Scrollbar,OptionButtonMultiplier)","v":7195},{"$f":"OFFSET(Daten_Auswahl!I15,Scrollbar,OptionButtonMultiplier)","v":2802},{"$f":"OFFSET(Daten_Auswahl!J15,Scrollbar,OptionButtonMultiplier)","v":9822},{"$f":"OFFSET(Daten_Auswahl!K15,Scrollbar,OptionButtonMultiplier)","v":5869}]
[]
[null,"Insgesamt"]
[null,"Gewerbe und Handwerk"]
[null,"Industrie"]
[null,"Handel"]
[null,"Bank und Versicherung"]
[null,"Transport und Verkehr"]
[null,"Tourismus und Freizeitwirtschaft"]
[null,"Information und Consulting"]
[null,"Sonstige Lehrberechtigte"]
[null,"Überbetriebliche Lehrausbildung 2"]
[]
[null,"1 Abweichungen zu veröffentlichten Statistiken der Bundesländer sind in Einzelfällen aufgrund unterschiedlicher Vorgehensweisen oder Kategorisierungen möglich. "]
[null,"2 Vor 2010 nur teilweise Erfassung der Überbetrieblichen Lehrausbildung."]
[null,"3  Bevölkerungsstatistik, STATISTIK AUSTRIA (2023: Prognose)"]
{"$rows_left_out":1}
{"sheet":"Daten","index":1,"n_rows":631,"n_cols":16,"rows_kept":631,"cut":false,"hidden":true,"merged":[]}
["BDL(alpha)_Jahr","Zeilenindex","BDL(alpha)","Jahr","1","2","3","4","5","6","7","8","9","10",null,"aus Tabellle Kreuztabelle Lehrlinge"]
[{"$f":"C2&D2","v":"11961"},2,1,1961,2516,79,487,null,null,83,null,null,null,3165]
["11962",3,1,1962,2758,78,608,null,null,106,null,null,null,3550]
["11963",4,1,1963,3109,102,682,null,null,147,null,null,null,4040]
["11964",5,1,1964,3369,137,712,null,null,175,null,null,null,4393]
["11965",6,1,1965,3419,139,738,null,null,177,null,null,null,4473]
["11966",7,1,1966,2663,105,537,null,null,174,null,null,null,3479]
["11967",8,1,1967,2587,87,510,null,null,140,null,null,null,3324]
["11968",9,1,1968,2577,83,534,null,null,182,null,null,null,3376]
["11969",10,1,1969,2923,101,663,null,1,174,null,null,null,3862]
["11970",11,1,1970,3157,110,656,null,1,214,null,1,null,4139]
["11971",12,1,1971,3170,120,632,0,2,257,null,1,null,4182]
["11972",13,1,1972,3211,137,686,null,3,286,null,null,null,4323]
["11973",14,1,1973,3289,177,711,1,1,327,null,null,null,4506]
["11974",15,1,1974,3322,206,737,3,1,336,null,null,null,4605]
["11975",16,1,1975,3391,224,752,5,null,372,null,null,null,4744]
["11976",17,1,1976,3406,231,772,6,1,413,null,null,null,4829]
["11977",18,1,1977,3475,290,842,6,1,440,null,null,null,5054]
["11978",19,1,1978,3529,319,841,5,2,457,null,7,null,5160]
["11979",20,1,1979,3533,332,869,2,2,495,null,7,null,5240]
["11980",21,1,1980,3494,358,859,null,2,497,null,5,null,5215]
["11981",22,1,1981,3309,344,822,0,0,477,null,5,null,4957]
["11982",23,1,1982,3058,308,793,3,1,518,null,5,null,4686]
["11983",24,1,1983,2906,241,703,4,2,506,null,5,null,4367]
["11984",25,1,1984,2822,263,707,4,2,521,null,4,null,4323]
["11985",26,1,1985,2769,258,680,2,1,527,null,5,null,4242]
["11986",27,1,1986,2756,263,669,2,null,526,null,3,null,4219]
["11987",28,1,1987,2745,263,563,3,13,525,null,25,null,4137]
["11988",29,1,1988,2695,247,575,4,12,501,null,39,null,4073]
["11989",30,1,1989,2707,248,547,3,8,453,null,52,null,4018]
{"$rows_left_out":602}
{"sheet":"Daten_Auswahl","index":2,"n_rows":71,"n_cols":20,"rows_kept":71,"cut":false,"hidden":true,"merged":[]}
[null,"Anzahl der Lehrlinge nach Sparten"]
[null,null,"Gewerbe und Handwerk","Industrie","Handel","Bank und Versicherung","Transport und Verkehr","Tourismus und Freizeitwirtschaft","Information und Consulting","Sonstige Lehrberechtigte","Überbetriebliche Lehrausbildung","Insgesamt"]
[null,2023,{"$f":"INDEX($B$9:$L$1000,MATCH($B3,Zeit,0),COLUMN(B1))","v":46666},16804,14763,1364,2981,7195,2802,9822,5869,108266]
[null,{"$f":"IFERROR(INDEX(Zeit,MATCH(OnClick,Zeit,0)),2000)","v":2000},{"$f":"INDEX($B$9:$L$1000,MATCH($B4,Zeit,0),COLUMN(B2))","v":67309},14557,19517,900,2269,13233,".",6230,2585,126600]
[null,{"$f":"\"Vergleich \" & B4 & \" und \" & B3","v":"Vergleich 2000 und 2023"}]
[null,null,5,6,7,8,9,10,11,12,13,14]
[null,"Nominal Werte",{"$f":"SUBSTITUTE(C8,\" \",)","v":"GewerbeundHandwerk"},{"$f":"SUBSTITUTE(D8,\" \",)","v":"Industrie"},"Handel","BankundVersicherung","TransportundVerkehr","TourismusundFreizeitwirtschaft","InformationundConsulting","SonstigeLehrberechtigte",{"$f":"SUBSTITUTE(SUBSTITUTE(K8,\" 2\",),\" \",)","v":"ÜberbetrieblicheLehrausbildung"},"Insgesamt",null,"Graph1","Graph2","GraphMax","GraphMin","Graph3_Skalierung","Skalierungsfaktor",1.3]
["Zeilenindex",null,"Gewerbe und Handwerk","Industrie","Handel","Bank und Versicherung","Transport und Verkehr","Tourismus und Freizeitwirtschaft","Information und Consulting","Sonstige Lehrberechtigte","Überbetriebliche Lehrausbildung","Insgesamt",null,{"$f":"IF(ISNA(MATCH(SUBSTITUTE(SUBSTITUTE(OnClick,\" 2\",),\" \",),Sparten,0)),\"Insgesamt\",OnClick_kurz)","v":"Insgesamt"},{"$f":"VLOOKUP(Graph1Title,S9:T18,2,FALSE) & \" - \" & Auswahl_Bundesland","v":"Insgesamt - ÖSTERREICH"},{"$f":"IF(Graph1Title=\"Insgesamt\",\"Lehrlings- und Bevölkerungsentwicklung im Vergleich ³\",\"\")","v":"Lehrlings- und Bevölkerungsentwicklung im Vergleich ³"}]
[{"$f":"VLOOKUP(Bundesland&Daten_Auswahl!$B9,Daten_Matrix,2,FALSE)","v":569},1961,{"$f":"IF(ISERROR($A9),0,IF(INDEX(Daten_Matrix,$A9,C$6)=0,\".\",INDEX(Daten_Matrix,$A9,C$6)))","v":87578},20726,30313,".",743,4388,".",".",".",143748,null,{"$f":"INDEX(INDIRECT(Graph1Title),ROW(A1))","v":143748},{"$f":"IF(SUM(P9:Q9)=0,N9,0)","v":143748},{"$f":"IF(N9>=LARGE(Graph1,5),N9,0)","v":0},{"$f":"IF(N9<=SMALL(Graph1,5),N9,0)","v":0},{"$f":"N9*Skalierungsfaktor","v":186872.4},"GewerbeundHandwerk","Gewerbe und Handwerk"]
[{"$f":"VLOOKUP(Bundesland&Daten_Auswahl!$B10,Daten_Matrix,2,FALSE)","v":570},1962,88738,21333,32259,".",852,5025,".",".",".",148207,null,{"$f":"INDEX(INDIRECT(Graph1Title),ROW(A2))","v":148207},148207,{"$f":"IF(N10>=LARGE(Graph1,5),N10,0)","v":0},{"$f":"IF(N10<=SMALL(Graph1,5),N10,0)","v":0},192669.1,"Industrie","Industrie"]
[{"$f":"VLOOKUP(Bundesland&Daten_Auswahl!$B11,Daten_Matrix,2,FALSE)","v":571},1963,91750,21601,34248,".",884,5807,".",".",".",154290,null,154290,154290,{"$f":"IF(N11>=LARGE(Graph1,5),N11,0)","v":0},{"$f":"IF(N11<=SMALL(Graph1,5),N11,0)","v":0},200577,"Handel","Handel"]
[{"$f":"VLOOKUP(Bundesland&Daten_Auswahl!$B12,Daten_Matrix,2,FALSE)","v":572},1964,91989,21219,33419,".",857,6441,".",".",".",153925,null,153925,153925,{"$f":"IF(N12>=LARGE(Graph1,5),N12,0)","v":0},{"$f":"IF(N12<=SMALL(Graph1,5),N12,0)","v":0},200102.5,"BankundVersicherung","Bank und Versicherung"]
[{"$f":"VLOOKUP(Bundesland&Daten_Auswahl!$B13,Daten_Matrix,2,FALSE)","v":573},1965,89277,20867,32527,".",834,6791,".",".",".",150296,null,150296,150296,{"$f":"IF(N13>=LARGE(Graph1,5),N13,0)","v":0},{"$f":"IF(N13<=SMALL(Graph1,5),N13,0)","v":0},195384.80000000002,"TransportundVerkehr","Transport und Verkehr"]
[{"$f":"VLOOKUP(Bundesland&Daten_Auswahl!$B14,Daten_Matrix,2,FALSE)","v":574},1966,68276,16518,23706,".",674,5729,".",".",".",114903,null,114903,114903,{"$f":"IF(N14>=LARGE(Graph1,5),N14,0)","v":0},{"$f":"IF(N14<=SMALL(Graph1,5),N14,0)","v":0},149373.9,"TourismusundFreizeitwirtschaft","Tourismus und Freizeitwirtschaft"]
[{"$f":"VLOOKUP(Bundesland&Daten_Auswahl!$B15,Daten_Matrix,2,FALSE)","v":575},1967,65289,15939,21900,".",679,5678,".",".",".",109485,null,109485,109485,{"$f":"IF(N15>=LARGE(Graph1,5),N15,0)","v":0},{"$f":"IF(N15<=SMALL(Graph1,5),N15,0)","v":0},142330.5,"InformationundConsulting","Information und Consulting"]
[{"$f":"VLOOKUP(Bundesland&Daten_Auswahl!$B16,Daten_Matrix,2,FALSE)","v":576},1968,64755,15595,21909,".",726,6095,".",".",".",109080,null,109080,109080,{"$f":"IF(N16>=LARGE(Graph1,5),N16,0)","v":0},{"$f":"IF(N16<=SMALL(Graph1,5),N16,0)","v":0},141804,"SonstigeLehrberechtigte","Sonstige Lehrberechtigte"]
[{"$f":"VLOOKUP(Bundesland&Daten_Auswahl!$B17,Daten_Matrix,2,FALSE)","v":577},1969,74374,17444,28150,".",1398,7285,".",".",".",128651,null,128651,128651,{"$f":"IF(N17>=LARGE(Graph1,5),N17,0)","v":0},{"$f":"IF(N17<=SMALL(Graph1,5),N17,0)","v":0},167246.30000000002,"ÜberbetrieblicheLehrausbildung","Überbetriebliche Lehrausbildung"]
[{"$f":"VLOOKUP(Bundesland&Daten_Auswahl!$B18,Daten_Matrix,2,FALSE)","v":578},1970,78670,18898,28711,26,1756,7872,".",1512,".",137445,null,137445,137445,{"$f":"IF(N18>=LARGE(Graph1,5),N18,0)","v":0},{"$f":"IF(N18<=SMALL(Graph1,5),N18,0)","v":0},178678.5,"Insgesamt","Insgesamt"]
[{"$f":"VLOOKUP(Bundesland&Daten_Auswahl!$B19,Daten_Matrix,2,FALSE)","v":579},1971,{"$f":"IF(ISERROR($A19),0,IF(INDEX(Daten_Matrix,$A19,C$6)=0,\".\",INDEX(Daten_Matrix,$A19,C$6)))","v":79289},20741,29923,93,2109,8494,".",1635,".",142284,null,142284,142284,{"$f":"IF(N19>=LARGE(Graph1,5),N19,0)","v":0},{"$f":"IF(N19<=SMALL(Graph1,5),N19,0)","v":0},184969.2]
[{"$f":"VLOOKUP(Bundesland&Daten_Auswahl!$B20,Daten_Matrix,2,FALSE)","v":580},1972,79110,22796,31646,269,2230,9159,".",1885,".",147095,null,147095,147095,{"$f":"IF(N20>=LARGE(Graph1,5),N20,0)","v":0},{"$f":"IF(N20<=SMALL(Graph1,5),N20,0)","v":0},191223.5]
[{"$f":"VLOOKUP(Bundesland&Daten_Auswahl!$B21,Daten_Matrix,2,FALSE)","v":581},1973,82080,25181,33250,574,2565,9854,".",2352,".",155856,null,155856,155856,{"$f":"IF(N21>=LARGE(Graph1,5),N21,0)","v":0},{"$f":"IF(N21<=SMALL(Graph1,5),N21,0)","v":0},202612.80000000002]
[{"$f":"VLOOKUP(Bundesland&Daten_Auswahl!$B22,Daten_Matrix,2,FALSE)","v":582},1974,85394,26512,34932,744,2711,10127,".",3131,".",163551,null,163551,163551,{"$f":"IF(N22>=LARGE(Graph1,5),N22,0)","v":0},{"$f":"IF(N22<=SMALL(Graph1,5),N22,0)","v":0},212616.30000000002]
[{"$f":"VLOOKUP(Bundesland&Daten_Auswahl!$B23,Daten_Matrix,2,FALSE)","v":583},1975,88928,26844,36226,704,2770,11319,".",3381,".",170172,null,170172,170172,{"$f":"IF(N23>=LARGE(Graph1,5),N23,0)","v":0},{"$f":"IF(N23<=SMALL(Graph1,5),N23,0)","v":0},221223.6]
[{"$f":"VLOOKUP(Bundesland&Daten_Auswahl!$B24,Daten_Matrix,2,FALSE)","v":584},1976,91898,27325,37917,643,2800,12613,".",3323,".",176519,null,176519,176519,{"$f":"IF(N24>=LARGE(Graph1,5),N24,0)","v":0},{"$f":"IF(N24<=SMALL(Graph1,5),N24,0)","v":0},229474.7]
[{"$f":"VLOOKUP(Bundesland&Daten_Auswahl!$B25,Daten_Matrix,2,FALSE)","v":585},1977,95815,27374,39715,524,2907,14143,".",3181,".",183659,null,183659,0,{"$f":"IF(N25>=LARGE(Graph1,5),N25,0)","v":183659},{"$f":"IF(N25<=SMALL(Graph1,5),N25,0)","v":0},238756.7]
[{"$f":"VLOOKUP(Bundesland&Daten_Auswahl!$B26,Daten_Matrix,2,FALSE)","v":586},1978,99773,27672,40920,522,2972,15249,".",3260,".",190368,null,190368,0,{"$f":"IF(N26>=LARGE(Graph1,5),N26,0)","v":190368},{"$f":"IF(N26<=SMALL(Graph1,5),N26,0)","v":0},247478.39999999999]
[{"$f":"VLOOKUP(Bundesland&Daten_Auswahl!$B27,Daten_Matrix,2,FALSE)","v":587},1979,102033,28015,40526,482,2973,15788,".",3335,".",193152,null,193152,0,{"$f":"IF(N27>=LARGE(Graph1,5),N27,0)","v":193152},{"$f":"IF(N27<=SMALL(Graph1,5),N27,0)","v":0},251097.60000000001]
[{"$f":"VLOOKUP(Bundesland&Daten_Auswahl!$B28,Daten_Matrix,2,FALSE)","v":588},1980,102051,28668,40536,524,3001,16232,".",3077,".",194089,null,194089,0,{"$f":"IF(N28>=LARGE(Graph1,5),N28,0)","v":194089},{"$f":"IF(N28<=SMALL(Graph1,5),N28,0)","v":0},252315.7]
[{"$f":"VLOOKUP(Bundesland&Daten_Auswahl!$B29,Daten_Matrix,2,FALSE)","v":589},1981,{"$f":"IF(ISERROR($A29),0,IF(INDEX(Daten_Matrix,$A29,C$6)=0,\".\",INDEX(Daten_Matrix,$A29,C$6)))","v":99041},28051,38453,477,2878,16081,".",3209,".",188190,null,188190,0,{"$f":"IF(N29>=LARGE(Graph1,5),N29,0)","v":188190},{"$f":"IF(N29<=SMALL(Graph1,5),N29,0)","v":0},244647]
[{"$f":"VLOOKUP(Bundesland&Daten_Auswahl!$B30,Daten_Matrix,2,FALSE)","v":590},1982,94444,27167,36670,532,2941,16496,".",3528,".",181778,null,181778,181778,{"$f":"IF(N30>=LARGE(Graph1,5),N30,0)","v":0},{"$f":"IF(N30<=SMALL(Graph1,5),N30,0)","v":0},236311.4]
{"$rows_left_out":42}
{"sheet":"Bev_15_20","index":3,"n_rows":721,"n_cols":5,"rows_kept":721,"cut":false,"hidden":true,"merged":[]}
["BDL(alpha)_Jahr","Zeilenindex","BDL","Jahr","SummevonBevoelkerung"]
[{"$f":"C2&D2","v":"11952"},2,1,1952,27430]
["11953",3,1,1953,26587]
["11954",4,1,1954,26406]
["11955",5,1,1955,26917]
["11956",6,1,1956,26929]
["11957",7,1,1957,26148]
["11958",8,1,1958,25183]
["11959",9,1,1959,24395]
["11960",10,1,1960,22686]
["11961",11,1,1961,20176]
["11962",12,1,1962,18954]
["11963",13,1,1963,19516]
["11964",14,1,1964,20692]
["11965",15,1,1965,21858]
["11966",16,1,1966,23418]
["11967",17,1,1967,25108]
["11968",18,1,1968,25939]
["11969",19,1,1969,26012]
["11970",20,1,1970,26091]
["11971",21,1,1971,26325]
["11972",22,1,1972,26597]
["11973",23,1,1973,26850]
["11974",24,1,1974,27220]
["11975",25,1,1975,27646]
["11976",26,1,1976,27954]
["11977",27,1,1977,28255]
["11978",28,1,1978,28518]
["11979",29,1,1979,28650]
["11980",30,1,1980,28365]
{"$rows_left_out":692}
{"sheet":"Bev_15_20_Auswahl","index":4,"n_rows":64,"n_cols":7,"rows_kept":64,"cut":false,"hidden":true,"merged":[]}
["Zeilenindex",null,"Bev_15_20","Bevölkerungspunkte","Max_Jahr",{"$f":"MAX(B:B)","v":2023},"Beschriftung_Bevölkerungslinie"]
[{"$f":"VLOOKUP(Bundesland&Bev_15_20_Auswahl!$B2,Bev_15_20_Matrix,2,FALSE)","v":659},1961,{"$f":"IF(Graph1Title=\"Insgesamt\",IF(ISERROR($A2),0,IF(INDEX(Bev_15_20_Matrix,$A2,5)=0,\".\",INDEX(Bev_15_20_Matrix,$A2,5))),NA())","v":640049},{"$f":"IF(RIGHT(B2,1)=\"0\",C2,IF(B2=Max_Jahr,C2,NA()))","v":{"$error":"#N/A"}},null,null,{"$f":"IF(Graph1Title=\"Insgesamt\",\"Bevölkerung der Altersgruppe 15-20 Jahre\",\"\")","v":"Bevölkerung der Altersgruppe 15-20 Jahre"}]
[{"$f":"VLOOKUP(Bundesland&Bev_15_20_Auswahl!$B3,Bev_15_20_Matrix,2,FALSE)","v":660},1962,610962,{"$error":"#N/A"}]
[{"$f":"VLOOKUP(Bundesland&Bev_15_20_Auswahl!$B4,Bev_15_20_Matrix,2,FALSE)","v":661},1963,602714,{"$error":"#N/A"}]
[{"$f":"VLOOKUP(Bundesland&Bev_15_20_Auswahl!$B5,Bev_15_20_Matrix,2,FALSE)","v":662},1964,598991,{"$error":"#N/A"}]
[{"$f":"VLOOKUP(Bundesland&Bev_15_20_Auswahl!$B6,Bev_15_20_Matrix,2,FALSE)","v":663},1965,592947,{"$error":"#N/A"}]
[{"$f":"VLOOKUP(Bundesland&Bev_15_20_Auswahl!$B7,Bev_15_20_Matrix,2,FALSE)","v":664},1966,599612,{"$error":"#N/A"}]
[{"$f":"VLOOKUP(Bundesland&Bev_15_20_Auswahl!$B8,Bev_15_20_Matrix,2,FALSE)","v":665},1967,611022,{"$error":"#N/A"}]
[{"$f":"VLOOKUP(Bundesland&Bev_15_20_Auswahl!$B9,Bev_15_20_Matrix,2,FALSE)","v":666},1968,608736,{"$error":"#N/A"}]
[{"$f":"VLOOKUP(Bundesland&Bev_15_20_Auswahl!$B10,Bev_15_20_Matrix,2,FALSE)","v":667},1969,602219,{"$error":"#N/A"}]
[{"$f":"VLOOKUP(Bundesland&Bev_15_20_Auswahl!$B11,Bev_15_20_Matrix,2,FALSE)","v":668},1970,603625,603625]
[{"$f":"VLOOKUP(Bundesland&Bev_15_20_Auswahl!$B12,Bev_15_20_Matrix,2,FALSE)","v":669},1971,614551,{"$error":"#N/A"}]
[{"$f":"VLOOKUP(Bundesland&Bev_15_20_Auswahl!$B13,Bev_15_20_Matrix,2,FALSE)","v":670},1972,632283,{"$error":"#N/A"}]
[{"$f":"VLOOKUP(Bundesland&Bev_15_20_Auswahl!$B14,Bev_15_20_Matrix,2,FALSE)","v":671},1973,652346,{"$error":"#N/A"}]
[{"$f":"VLOOKUP(Bundesland&Bev_15_20_Auswahl!$B15,Bev_15_20_Matrix,2,FALSE)","v":672},1974,670477,{"$error":"#N/A"}]
[{"$f":"VLOOKUP(Bundesland&Bev_15_20_Auswahl!$B16,Bev_15_20_Matrix,2,FALSE)","v":673},1975,688653,{"$error":"#N/A"}]
[{"$f":"VLOOKUP(Bundesland&Bev_15_20_Auswahl!$B17,Bev_15_20_Matrix,2,FALSE)","v":674},1976,711523,{"$error":"#N/A"}]
[{"$f":"VLOOKUP(Bundesland&Bev_15_20_Auswahl!$B18,Bev_15_20_Matrix,2,FALSE)","v":675},1977,734943,{"$error":"#N/A"}]
[{"$f":"VLOOKUP(Bundesland&Bev_15_20_Auswahl!$B19,Bev_15_20_Matrix,2,FALSE)","v":676},1978,753282,{"$error":"#N/A"}]
[{"$f":"VLOOKUP(Bundesland&Bev_15_20_Auswahl!$B20,Bev_15_20_Matrix,2,FALSE)","v":677},1979,769221,{"$error":"#N/A"}]
[{"$f":"VLOOKUP(Bundesland&Bev_15_20_Auswahl!$B21,Bev_15_20_Matrix,2,FALSE)","v":678},1980,781590,781590]
[{"$f":"VLOOKUP(Bundesland&Bev_15_20_Auswahl!$B22,Bev_15_20_Matrix,2,FALSE)","v":679},1981,789740,{"$error":"#N/A"}]
[{"$f":"VLOOKUP(Bundesland&Bev_15_20_Auswahl!$B23,Bev_15_20_Matrix,2,FALSE)","v":680},1982,789886,{"$error":"#N/A"}]
[{"$f":"VLOOKUP(Bundesland&Bev_15_20_Auswahl!$B24,Bev_15_20_Matrix,2,FALSE)","v":681},1983,783204,{"$error":"#N/A"}]
[{"$f":"VLOOKUP(Bundesland&Bev_15_20_Auswahl!$B25,Bev_15_20_Matrix,2,FALSE)","v":682},1984,773598,{"$error":"#N/A"}]
[{"$f":"VLOOKUP(Bundesland&Bev_15_20_Auswahl!$B26,Bev_15_20_Matrix,2,FALSE)","v":683},1985,757293,{"$error":"#N/A"}]
[{"$f":"VLOOKUP(Bundesland&Bev_15_20_Auswahl!$B27,Bev_15_20_Matrix,2,FALSE)","v":684},1986,{"$f":"IF(Graph1Title=\"Insgesamt\",IF(ISERROR($A27),0,IF(INDEX(Bev_15_20_Matrix,$A27,5)=0,\".\",INDEX(Bev_15_20_Matrix,$A27,5))),NA())","v":737187},{"$f":"IF(RIGHT(B27,1)=\"0\",C27,IF(B27=Max_Jahr,C27,NA()))","v":{"$error":"#N/A"}}]
[{"$f":"VLOOKUP(Bundesland&Bev_15_20_Auswahl!$B28,Bev_15_20_Matrix,2,FALSE)","v":685},1987,713404,{"$error":"#N/A"}]
[{"$f":"VLOOKUP(Bundesland&Bev_15_20_Auswahl!$B29,Bev_15_20_Matrix,2,FALSE)","v":686},1988,684945,{"$error":"#N/A"}]
[{"$f":"VLOOKUP(Bundesland&Bev_15_20_Auswahl!$B30,Bev_15_20_Matrix,2,FALSE)","v":687},1989,657474,{"$error":"#N/A"}]
{"$rows_left_out":35}
{"sheet":"Wappen","index":5,"n_rows":10,"n_cols":8,"rows_kept":10,"cut":false,"hidden":true,"merged":[]}
[null,"Burgenland",1,{"$f":"Auswahl_Bundesland","v":"ÖSTERREICH"},{"$f":"LOOKUP(D1,B1:B10,C1:C10)","v":5},null,null,{"$f":"INDIRECT(\"$A$\"&E1)","v":0}]
[null,"Kärnten",2]
[null,"Niederösterreich",3]
[null,"Oberösterreich",4]
[null,"Österreich",5]
[null,"Salzburg",6]
[null,"Steiermark",7]
[null,"Tirol",8]
[null,"Vorarlberg",9]
[null,"Wien",10]

{"sheet":"Stage","index":6,"n_rows":81,"n_cols":9,"rows_kept":81,"cut":false,"hidden":true,"merged":[]}
[]
[null,"Scrollbar",56]
[null,"OptionButtons",1,{"$f":"IF(OptionButton=1,0,11)","v":0}]
[null,"OnClick",null,{"$f":"SUBSTITUTE(SUBSTITUTE(OnClick,\" 2\",),\" \",)","v":""}]
[]
[null,"Dropdown-Bundesland"]
[null,null,null,null,"Auswahl","Auswahl_Bundesland",null,null,"Beschriftung der Bevölkerungsentwicklung der 15-20-Jährigen"]
[null,1,"BURGENLAND",null,10,{"$f":"LOOKUP(E8,B8:C17)","v":"ÖSTERREICH"},null,null,{"$f":"IF(Graph1Title=\"Insgesamt\",\"Bevölkerung der Altersgruppe 15-20 Jahre\",\"\")","v":"Bevölkerung der Altersgruppe 15-20 Jahre"}]
[null,2,"KÄRNTEN",null,null,null,null,null,{"$f":"IF(Graph1Title=\"Insgesamt\",\"Bevölkerung der Altersgruppe 15-20 Jahre zum Jahr\",\"\")","v":"Bevölkerung der Altersgruppe 15-20 Jahre zum Jahr"}]
[null,3,"NIEDERÖSTERREICH"]
[null,4,"OBERÖSTERREICH"]
[null,5,"SALZBURG"]
[null,6,"STEIERMARK"]
[null,7,"TIROL"]
[null,8,"VORARLBERG"]
[null,9,"WIEN"]
[null,10,"ÖSTERREICH"]
[]
[null,1961,1,"Maximalwert",{"$f":"MAX(C19:C1000)","v":63}]
[null,1962,2]
[null,1963,3]
[null,1964,4]
[null,1965,5]
[null,1966,6]
[null,1967,7]
[null,1968,8]
[null,1969,9]
[null,1970,10]
[null,1971,11]
[null,1972,12]
{"$rows_left_out":51}