{"text_format":"1","workbook":"xlsx","n_sheets":7,"sheets":["Europe Map","Data","Control","Pivot","Karte","HVPI","Zeitraum"],"not_rendered":{"charts":0,"images":5,"macros":1,"external_links":0,"defined_names":29,"comments":0,"pivot_tables":0},"unopened":[],"bounds":{"document_bytes":16777216,"sheet_cells":100000,"rows_first":2000,"rows_last":500,"rows_between":2000,"halvings":0,"cell_chars":16384,"cell_head_chars":4096},"cells_cut":0,"cells_raw":0,"read":"whole","date_system":"1900"}

{"sheet":"Europe Map","index":0,"n_rows":1,"n_cols":5,"rows_kept":1,"cut":false,"hidden":false,"merged":[[44,0,44,6],[0,4,0,7]]}
[" HVPI - Gesamtindex",null,null,null,{"$f":"Zeitraum_Beschriftung","v":"September 2024"}]

{"sheet":"Data","index":1,"n_rows":42,"n_cols":12,"rows_kept":42,"cut":false,"hidden":true,"merged":[]}
["Werte für",{"$f":"Zeitraum","v":"2024-09-01"},null,{"$f":"Auswahl_Zeitraum","v":193}]
["No.","Abbreviation","Country","Values","Klassen","R","G","B",null,"Hilfsspalte"]
[1,"ALB","Albanien",{"$f":"IF(ISERROR(VLOOKUP(B3,Matrix_HVPI,Auswahl_Zeitraum,FALSE)),999999,VLOOKUP(B3,Matrix_HVPI,Auswahl_Zeitraum,FALSE))","v":999999},{"$f":"IF(D3=999999,9,IF(AND(D3>=MIN,D3<=Klasse1_MAX),1,IF(AND(D3>=Klasse2_MIN,D3<=Klasse2_MAX),2,IF(AND(D3>=Klasse3_MIN,D3<=Klasse3_MAX),3,IF(AND(D3>=Klasse4_MIN,D3<=Klasse4_MAX),4,IF(AND(D3>=Klasse5_MIN,D3<=Klasse5_MAX),5,IF(AND(D3>=Klasse6_MIN,D3<=Klasse6_MAX),6,IF(AND(D3>=Klasse7_MIN,D3<=Klasse7_MAX),7,IF(AND(D3>=Klasse8_MIN,D3<=MAX),8,9)))))))))","v":9},{"$f":"LOOKUP(E3,Control!$K$3:$K$11,Control!$H$3:$H$11)","v":150},{"$f":"LOOKUP(E3,Control!$K$3:$K$11,Control!$I$3:$I$11)","v":150},{"$f":"LOOKUP(E3,Control!$K$3:$K$11,Control!$J$3:$J$11)","v":150},{"$f":"C3","v":"Albanien"},{"$f":"IF(D3=999999,\"\",IF(D3=0,ROW()/1000000,D3-ROW()/1000000))","v":""},{"$f":"INDEX($I$3:$I$65526,MATCH(LARGE($J$3:$J$65526,ROW(M1)),$J$3:$J$65526,0))","v":"Türkei"},{"$f":"VLOOKUP(K3,$C$3:$D$65526,2,FALSE)","v":49.5}]
[{"$f":"A3+1","v":2},"AUT","Österreich",1.8,4,{"$f":"LOOKUP(E4,Control!$K$3:$K$11,Control!$H$3:$H$11)","v":0},{"$f":"LOOKUP(E4,Control!$K$3:$K$11,Control!$I$3:$I$11)","v":104},{"$f":"LOOKUP(E4,Control!$K$3:$K$11,Control!$J$3:$J$11)","v":55},{"$f":"C4","v":"Österreich"},{"$f":"IF(D4=999999,\"\",IF(D4=0,ROW()/1000000,D4-ROW()/1000000))","v":1.7999960000000002},{"$f":"INDEX($I$3:$I$65526,MATCH(LARGE($J$3:$J$65526,ROW(M2)),$J$3:$J$65526,0))","v":"Rumänien"},{"$f":"VLOOKUP(K4,$C$3:$D$65526,2,FALSE)","v":4.8}]
[3,"BLR","Weißrussland",999999,9,{"$f":"LOOKUP(E5,Control!$K$3:$K$11,Control!$H$3:$H$11)","v":150},{"$f":"LOOKUP(E5,Control!$K$3:$K$11,Control!$I$3:$I$11)","v":150},{"$f":"LOOKUP(E5,Control!$K$3:$K$11,Control!$J$3:$J$11)","v":150},"Weißrussland","","Belgien",4.3]
[4,"BEL","Belgien",4.3,5,{"$f":"LOOKUP(E6,Control!$K$3:$K$11,Control!$H$3:$H$11)","v":254},{"$f":"LOOKUP(E6,Control!$K$3:$K$11,Control!$I$3:$I$11)","v":227},{"$f":"LOOKUP(E6,Control!$K$3:$K$11,Control!$J$3:$J$11)","v":145},"Belgien",4.2999939999999999,"Polen",4.2]
[5,"BIH","Bosnien u. Herzegowina",999999,9,{"$f":"LOOKUP(E7,Control!$K$3:$K$11,Control!$H$3:$H$11)","v":150},{"$f":"LOOKUP(E7,Control!$K$3:$K$11,Control!$I$3:$I$11)","v":150},{"$f":"LOOKUP(E7,Control!$K$3:$K$11,Control!$J$3:$J$11)","v":150},"Bosnien u. Herzegowina","","Island",3.4]
[6,"BGR","Bulgarien",1.5,4,{"$f":"LOOKUP(E8,Control!$K$3:$K$11,Control!$H$3:$H$11)","v":0},{"$f":"LOOKUP(E8,Control!$K$3:$K$11,Control!$I$3:$I$11)","v":104},{"$f":"LOOKUP(E8,Control!$K$3:$K$11,Control!$J$3:$J$11)","v":55},"Bulgarien",1.499992,"Niederlande",3.3]
[7,"HRV","Kroatien",3.1,5,{"$f":"LOOKUP(E9,Control!$K$3:$K$11,Control!$H$3:$H$11)","v":254},{"$f":"LOOKUP(E9,Control!$K$3:$K$11,Control!$I$3:$I$11)","v":227},{"$f":"LOOKUP(E9,Control!$K$3:$K$11,Control!$J$3:$J$11)","v":145},"Kroatien",3.0999910000000002,"Estland",3.2]
[8,"CZE","Tschechische Republik",2.8,5,{"$f":"LOOKUP(E10,Control!$K$3:$K$11,Control!$H$3:$H$11)","v":254},{"$f":"LOOKUP(E10,Control!$K$3:$K$11,Control!$I$3:$I$11)","v":227},{"$f":"LOOKUP(E10,Control!$K$3:$K$11,Control!$J$3:$J$11)","v":145},"Tschechische Republik",2.7999899999999998,"Kroatien",3.1]
[9,"DNK","Dänemark",1.2,4,{"$f":"LOOKUP(E11,Control!$K$3:$K$11,Control!$H$3:$H$11)","v":0},{"$f":"LOOKUP(E11,Control!$K$3:$K$11,Control!$I$3:$I$11)","v":104},{"$f":"LOOKUP(E11,Control!$K$3:$K$11,Control!$J$3:$J$11)","v":55},"Dänemark",1.199989,"Griechenland",3.1]
[10,"EST","Estland",3.2,5,{"$f":"LOOKUP(E12,Control!$K$3:$K$11,Control!$H$3:$H$11)","v":254},{"$f":"LOOKUP(E12,Control!$K$3:$K$11,Control!$I$3:$I$11)","v":227},{"$f":"LOOKUP(E12,Control!$K$3:$K$11,Control!$J$3:$J$11)","v":145},"Estland",3.1999880000000003,"Ungarn",3]
[11,"FIN","Finnland",1,3,{"$f":"LOOKUP(E13,Control!$K$3:$K$11,Control!$H$3:$H$11)","v":49},{"$f":"LOOKUP(E13,Control!$K$3:$K$11,Control!$I$3:$I$11)","v":163},{"$f":"LOOKUP(E13,Control!$K$3:$K$11,Control!$J$3:$J$11)","v":84},"Finnland",0.99998699999999996,"Slowakei",2.9]
[12,"FRA","Frankreich",1.4,4,{"$f":"LOOKUP(E14,Control!$K$3:$K$11,Control!$H$3:$H$11)","v":0},{"$f":"LOOKUP(E14,Control!$K$3:$K$11,Control!$I$3:$I$11)","v":104},{"$f":"LOOKUP(E14,Control!$K$3:$K$11,Control!$J$3:$J$11)","v":55},"Frankreich",1.399986,"Tschechische Republik",2.8]
[13,"DEU","Deutschland",1.8,4,{"$f":"LOOKUP(E15,Control!$K$3:$K$11,Control!$H$3:$H$11)","v":0},{"$f":"LOOKUP(E15,Control!$K$3:$K$11,Control!$I$3:$I$11)","v":104},{"$f":"LOOKUP(E15,Control!$K$3:$K$11,Control!$J$3:$J$11)","v":55},"Deutschland",1.7999849999999999,"Norwegen",2.7]
{"$rows_left_out":28}
{"sheet":"Control","index":2,"n_rows":17,"n_cols":20,"rows_kept":17,"cut":false,"hidden":true,"merged":[[10,4,10,6]]}
[]
[null,null,null,null,"MIN",null,"MAX","R","G","B","Klasse"]
[null,null,null,null,-17,"bis",-2.0099999999999998,194,230,153,1]
[null,null,null,null,-2,"bis",-1.01,120,198,121,2,null,"Neue Farbskala"]
[null,null,null,null,-1,"bis",1,49,163,84,3]
["Selection",7,null,null,1.01,"bis",2,0,104,55,4,null,null,-17,"bis",-2.0099999999999998,194,230,153,1]
["Darkness",5,null,null,2.0099999999999998,"bis",5,254,227,145,5,null,null,-2,"bis",-1.01,120,198,121,2]
["Min / Max",{"$f":"MAX(rngValues)","v":999999},null,null,5.01,"bis",10,254,196,79,6,null,null,-1,"bis",1,49,163,84,3]
["Min / Max",{"$f":"MIN(rngValues)","v":0},null,null,10.01,"bis",20,254,153,41,7,null,null,1.01,"bis",2,0,104,55,4]
["Min / Max",{"$f":"(B8-B9)/D16","v":166666.5},null,null,20.010000000000002,"bis",100,236,112,20,8,null,null,2.0099999999999998,"bis",5,255,216,137,5]
["Threshold","Klasse",null,null,"Daten nicht verfügbar",null,null,150,150,150,9,null,null,5.01,"bis",10,255,184,79,6]
[{"$f":"B9","v":0},null,null,null,null,null,null,null,null,null,null,null,null,10.01,"bis",20,250,149,0,7]
[{"$f":"A12+$B$10","v":166666.5},1,null,null,null,null,null,null,null,null,null,null,null,20.010000000000002,"bis",100,222,132,0,8]
[333333,2,null,null,null,null,null,null,null,null,null,null,null,"Daten nicht verfügbar",null,null,150,150,150,9]
[499999.5,3]
{"$rows_left_out":3}
{"sheet":"Pivot","index":3,"n_rows":37,"n_cols":8,"rows_kept":37,"cut":false,"hidden":true,"merged":[]}
[null,null,null,null,null,{"$f":"IF(LEN(ControlCell)=3,ControlCell,RIGHT(LEFT(ControlCell,5),3))","v":"AUT"},"AUT"]
[null,null,null,null,null,{"$f":"IF(ISNA(G2),\"AUT\",G2)","v":"Österreich"},{"$f":"VLOOKUP(ControllCell_bereinigt,Data!$B$3:$C$41,2,FALSE)","v":"Österreich"},"Value"]
[null,null,null,null,null,{"$f":"COUNTIF(F7:F37,\">0\")","v":30},{"$f":"COUNTIF(rngValues,\">0\")","v":39},{"$f":"IF(ISERROR(VLOOKUP(F2,E7:F65525,2,FALSE)),\"Daten nicht verfügbar\",TEXT(VLOOKUP(F2,E7:F65525,2,FALSE),\"#0,0\"))","v":"1,8"}]
[]
[null,null,null,null,"HVPI - Gesamtindex"]
[null,null,null,null,{"$f":"IF(Zeitraum!E2=\"31.12.\",\"Veränd. zum VJ. in %\",\"Veränd. zum VJM. in %\")","v":"Veränd. zum VJM. in %"}]
[null,null,null,1,{"$f":"Data!K3","v":"Türkei"},{"$f":"Data!L3","v":49.5},null,{"$f":"IF(Zeitraum!E2=\"31.12.\",\"Veränderungsrate zum Vorjahr in %\",\"Veränderungsrate zum Vorjahresmonat in %\")","v":"Veränderungsrate zum Vorjahresmonat in %"}]
[null,null,null,{"$f":"C3-(C3-D7)+1","v":2},{"$f":"Data!K4","v":"Rumänien"},{"$f":"Data!L4","v":4.8}]
[null,null,null,{"$f":"C4-(C4-D8)+1","v":3},{"$f":"Data!K5","v":"Belgien"},{"$f":"Data!L5","v":4.3}]
[null,null,null,4,{"$f":"Data!K6","v":"Polen"},{"$f":"Data!L6","v":4.2}]
[null,null,null,5,{"$f":"Data!K7","v":"Island"},{"$f":"Data!L7","v":3.4}]
[null,null,null,6,{"$f":"Data!K8","v":"Niederlande"},{"$f":"Data!L8","v":3.3}]
[null,null,null,7,{"$f":"Data!K9","v":"Estland"},{"$f":"Data!L9","v":3.2}]
[null,null,null,8,{"$f":"Data!K10","v":"Kroatien"},{"$f":"Data!L10","v":3.1}]
[null,null,null,9,{"$f":"Data!K11","v":"Griechenland"},{"$f":"Data!L11","v":3.1}]
{"$rows_left_out":23}
{"sheet":"Karte","index":4,"n_rows":0,"n_cols":0,"rows_kept":0,"cut":false,"hidden":true,"merged":[]}

{"sheet":"HVPI","index":5,"n_rows":44,"n_cols":193,"rows_kept":44,"cut":false,"hidden":true,"merged":[]}
["HVPI (2005 = 100) bzw 2015=100 - Monatliche Daten (jährliche Veränderungsrate) [prc_hicp_manr]"]
[null,null,null,null,null,null,null,null,null,null,null,"Klassen"]
["Letzte Aktualisierung","2016-01-05T07:30:11",null,null,null,null,null,null,{"$f":"MAX(C11:CA41)","v":11.6},"Max",null,"2 - 17"]
["Exportierte Daten","2016-01-08T15:45:04.254",null,null,null,null,null,null,{"$f":"MIN(C11:CA41)","v":-4.3},"Min",null,"1 - 2"]
["Quelle der Daten","Eurostat",null,null,null,null,null,null,null,null,null,"0 - 1"]
[null,null,null,null,null,null,null,null,null,null,null,"-2 - -1"]
["UNIT","Jährliche Veränderungsrate",null,null,null,null,null,null,null,null,null,"-17 - -2"]
["COICOP","Gesamt-HVPI"]
[1,2,3,4,5,6,7,8,9,10,11,12,13,14,15,16,17,18,19,20,21,22,23,24,25,26,27,28,29,30,31,32,33,34,35,36,37,38,39,40,41,42,43,44,45,46,47,48,49,50,51,52,53,54,55,56,57,58,59,60,61,62,63,64,65,66,67,68,69,70,71,72,73,74,75,76,77,78,79,80,81,82,83,84,85,86,87,88,89,90,91,92,93,94,95,96,97,98,99,100,101,102,103,104,105,106,107,108,109,110,111,112,113,114,115,116,117,118,119,120,121,122,123,124,125,126,127,128,129,130,131,132,133,134,135,136,137,138,139,140,141,142,143,144,145,146,147,148,149,150,151,152,153,154,155,156,157,158,159,160,161,162,163,164,165,166,167,168,169,170,171,172,173,174,175,176,177,178,179,180,181,182,183,184,185,186,187,188,189,190,191,192,193]
[null,"GEO/TIME","2010-01-01","2010-02-01","2010-03-01","2010-04-01","2010-05-01","2010-06-01","2010-07-01","2010-08-01","2010-09-01","2010-10-01","2010-11-01","2010-12-01","2010-12-31","2011-01-01","2011-02-01","2011-03-01","2011-04-01","2011-05-01","2011-06-01","2011-07-01","2011-08-01","2011-09-01","2011-10-01","2011-11-01","2011-12-01","2011-12-31","2012-01-01","2012-02-01","2012-03-01","2012-04-01","2012-05-01","2012-06-01","2012-07-01","2012-08-01","2012-09-01","2012-10-01","2012-11-01","2012-12-01","2012-12-31","2013-01-01","2013-02-01","2013-03-01","2013-04-01","2013-05-01","2013-06-01","2013-07-01","2013-08-01","2013-09-01","2013-10-01","2013-11-01","2013-12-01","2013-12-31","2014-01-01","2014-02-01","2014-03-01","2014-04-01","2014-05-01","2014-06-01","2014-07-01","2014-08-01","2014-09-01","2014-10-01","2014-11-01","2014-12-01","2014-12-31","2015-01-01","2015-02-01","2015-03-01","2015-04-01","2015-05-01","2015-06-01","2015-07-01","2015-08-01","2015-09-01","2015-10-01","2015-11-01","2015-12-01","2015-12-31","2016-01-01","2016-02-01","2016-03-01","2016-04-01","2016-05-01","2016-06-01","2016-07-01","2016-08-01","2016-09-01","2016-10-01","2016-11-01","2016-12-01","2016-12-31","2017-01-01","2017-02-01","2017-03-01","2017-04-01","2017-05-01","2017-06-01","2017-07-01","2017-08-01","2017-09-01","2017-10-01","2017-11-01","2017-12-01","2017-12-31","2018-01-01","2018-02-01","01.03.018","2018-04-01","2018-05-01","2018-06-01","2018-07-01","2018-08-01","2018-09-01","2018-10-01","2018-11-01","2018-12-01","2018-12-31","2019-01-01","2019-02-01","2019-03-01","2019-04-01","2019-05-01","2019-06-01","2019-07-01","2019-08-01","2019-09-01","2019-10-01","2019-11-01","2019-12-01","2019-12-31","2020-01-01","2020-02-01","2020-03-01","2020-04-01","2020-05-01","2020-06-01","2020-07-01","2020-08-01","2020-09-01","2020-10-01","2020-11-01","2020-12-01","2020-12-31","2021-01-01","2021-02-01","2021-03-01","2021-04-01","2021-05-01","2021-06-01","2021-07-01","2021-08-01","2021-09-01","2021-10-01","2021-11-01","2021-12-01","2021-12-31","2022-01-01","2022-02-01","2022-03-01","2022-04-01","2022-05-01","2022-06-01","2022-07-01","2022-08-01","2022-09-01","2022-10-01","2022-11-01","2022-12-01","2022-12-31","2023-01-01","2023-02-01","2023-03-01","2023-04-01","2023-05-01","2023-06-01","2023-07-01","2023-08-01","2023-09-01","2023-10-01","2023-11-01","2023-12-01","2023-12-31","2024-01-01","2024-02-01","2024-03-01","2024-04-01","2024-05-01","2024-06-01","2024-07-01","2024-08-01","2024-09-01"]
["BEL","Belgien",0.8,0.8,1.9,2.1,2.5,2.7,2.4,2.4,2.9,3.1,3,3.4,2.2999999999999998,3.5,3.5,3.3,3.1,2.9,3.3,4,3.4,3.2,3.2,3.5,3.2,3.4,3.3,3.4,3.1,2.9,2.6,2.2000000000000002,2,2.6,2.6,2.7,2.2000000000000002,2.1,2.6,1.5,1.4,1.3,1.1000000000000001,1.1000000000000001,1.5,1.6,1.1000000000000001,1,0.7,0.9,1.2,1.2,1.1000000000000001,1,0.9,0.9,0.8,0.7,0.6,0.4,0.2,0.3,0.1,-0.4,0.5,-0.6,-0.4,-0.1,0.4,0.8,0.9,0.9,0.8,0.9,1.2,1.4,1.5,0.6,1.8,1.1000000000000001,1.6,1.5,1.6,1.8,2,2,1.8,1.9,1.7,2.2000000000000002,1.8,3.1,3.3,2.5,2.7,1.9,1.5,1.8,2,2,1.8,2.1,2.1,2.2000000000000002,1.8,1.5,1.5,1.6,2.2999999999999998,2.6,2.7,2.6,2.8,3.2,2.9,2.2000000000000002,2.2999999999999998,1.8,2,2.2000000000000002,2,1.7,1.3,1.2,0.9,0.6,0.2,0.4,0.9,1.2,1.4,1,0.4,0,-0.2,0.2,1.7,-0.9,0.5,0.4,0.2,0.4,0.4,0.6,0.3,1.6,2.1,2.5,2.6,1.4,4.7,3.8,5.4,7.1,6.6,3.2,8.5,9.5,9.3000000000000007,9.3000000000000007,9.9,10.5,10.4,10.5,12.1,13.1,10.5,10.199999999999999,10.3,7.4,5.4,4.9000000000000004,3.3,2.7,1.6,1.7,2.4,0.7,-1.7,-0.8,0.5,2.2999999999999998,1.5,3.6,3.8,4.9000000000000004,4.9000000000000004,5.4,5.4,4.3,4.3]
["BGR","Bulgarien",1.8,1.7,2.4,3,3,2.5,3.2,3.2,3.6,3.6,4,4.4000000000000004,3,4.3,4.5999999999999996,4.5999999999999996,3.3,3.4,3.5,3.4,3.1,2.9,3,2.6,2,3.4,1.9,2,1.7,2,1.8,1.6,2.4,3.1,3.4,3,2.7,2.8,2.4,2.6,2.2000000000000002,1.6,0.9,1,1.2,0,-0.7,-1.3,-1.1000000000000001,-1,-0.9,0.4,-1.4,-2.1,-2,-1.3,-1.8,-1.8,-1.1000000000000001,-1,-1.4,-1.5,-1.9,-2,-1.6,-2.4,-1.7,-1.1000000000000001,-0.9,-0.3,-0.6,-1,-0.8,-0.9,-1.2,-0.9,-0.9,-1.1000000000000001,-0.4,-1,-1.9,-2.5,-2.5,-1.9,-1.1000000000000001,-1.1000000000000001,-1.1000000000000001,-1,-0.8,-0.5,-1.3,0.4,0.9,1,1.7,1.4,1.1000000000000001,0.6,0.7,1.3,1.5,1.9,1.8,1.2,1.3,1.5,1.9,1.7,2.2999999999999998,3,3.6,3.7,3.6,3.6,3,2.2999999999999998,2.6,2.2999999999999998,2.4,2.8,3.1,2.9,2.2999999999999998,2.6,2.5,1.6,1.6,2.2000000000000002,3.1,2.5,3.4,3.1,2.4,1.3,1,0.9,0.4,0.6,0.6,0.6,0.3,0,1.2,-0.3,0.2,0.8,2,2.2999999999999998,2.4,2.2000000000000002,2.5,4,5.2,6.3,6.6,2.8,7.7,8.4,10.5,12.1,13.4,14.8,14.9,15,15.6,14.8,14.3,14.3,13,14.3,13.7,12.1,10.3,8.6,7.5,7.8,7.5,6.4,5.9,5.5,5,8.6,3.9,3.5,3.1,2.5,2.7,2.8,2.8,2.4,1.5]
["CZE","Tschechische Republik",0.4,0.4,0.4,0.9,1,1,1.6,1.5,1.8,1.8,1.9,2.2999999999999998,1.2,1.9,1.9,1.9,1.6,2,1.9,1.9,2.1,2.1,2.6,2.9,2.8,2.1,3.8,4,4.2,4,3.5,3.8,3.3,3.4,3.5,3.6,2.8,2.4,3.5,1.8,1.8,1.5,1.7,1.2,1.6,1.4,1.2,1,0.8,1,1.5,1.4,0.3,0.3,0.3,0.2,0.5,0,0.6,0.7,0.8,0.7,0.6,0.1,0.4,-0.1,-0.1,0.1,0.5,0.7,0.9,0.4,0.2,0.2,0.2,0,-0.1,0.3,0.5,0.5,0.3,0.5,0,-0.1,0.5,0.6,0.5,0.8,1.6,2.1,0.6,2.2999999999999998,2.6,2.6,2.1,2.5,2.4,2.4,2.4,2.5,2.8,2.5,2.2000000000000002,2.4,2.1,1.6,1.6,1.8,2,2.4,2.2000000000000002,2.4,2.1,2,1.6,1.6,2,2,2.4,2.6,2.4,2.6,2.4,2.6,2.6,2.6,2.6,3,3.2,2.6,3.8,3.7,3.6,3.3,3.1,3.4,3.6,3.5,3.3,2.9,2.8,2.4,3.3,2.2000000000000002,2.1,2.2999999999999998,3.1,2.7,2.5,2.7,3.1,4,4.8,4.8,5.4,3.3,8.8000000000000007,10,11.9,13.2,15.2,16.600000000000001,17.3,17.100000000000001,17.8,15.5,17.2,16.8,14.8,19.100000000000001,18.399999999999999,16.5,14.3,12.5,11.2,10.199999999999999,10.1,8.3000000000000007,9.5,8,7.6,12,2.7,2.2000000000000002,2.2000000000000002,3.1,2.8,2.2000000000000002,2.5,2.4,2.8]
["DNK","Dänemark",1.9,1.8,2.1,2.4,1.9,1.7,2.1,2.2999999999999998,2.5,2.4,2.5,2.8,2.2000000000000002,2.6,2.6,2.5,2.8,3.1,2.9,3,2.4,2.4,2.7,2.5,2.4,2.7,2.8,2.7,2.7,2.2999999999999998,2.1,2.2000000000000002,2.1,2.6,2.5,2.2999999999999998,2.2000000000000002,1.9,2.4,1,1,0.7,0.4,0.6,0.6,0.4,0.1,0.2,0.3,0.3,0.4,0.5,0.8,0.3,0.2,0.5,0.3,0.4,0.5,0.3,0.3,0.3,0.2,0.1,0.3,-0.3,0,0.3,0.4,0.4,0.4,0.5,0.3,0.3,0.2,0.1,0.3,0.2,0.4,0.1,-0.3,-0.3,-0.1,0.1,0.1,0,-0.3,0.1,0.1,0.3,0,0.7,0.9,0.9,1,0.7,0.4,1.5,1.5,1.6,1.4,1.3,0.8,1.1000000000000001,0.6,0.5,0.4,0.7,1,1.1000000000000001,0.9,0.8,0.5,0.7,0.7,0.7,0.7,1.2,1.1000000000000001,1.2,0.9,0.7,0.5,0.4,0.5,0.4,0.6,0.6,0.8,0.7,0.8,0.7,0.3,-0.1,-0.2,0.2,0.4,0.4,0.5,0.3,0.4,0.4,0.3,0.4,0.5,0.9,1.5,1.9,1.9,1.7,1.8,2.4,3.2,3.8,3.4,1.9,4.9000000000000004,5.3,6,7.4,8.1999999999999993,9.1,9.6,9.9,11.1,11.4,9.6999999999999993,9.6,8.5,8.4,8.3000000000000007,7.3,5.6,2.9,2.4,3.2,2.2999999999999998,0.6,-0.4,0.3,0.4,3.4,0.9,0.6,0.8,0.5,2.1,1.8,1,1.4,1.2]
["DEU","Deutschland (bis 1990 früheres Gebiet der BRD)",0.8,0.5,1.2,1,1.2,0.8,1.2,1,1.3,1.3,1.6,1.9,1.2,2,2.2000000000000002,2.2999999999999998,2.7,2.4,2.4,2.6,2.5,2.9,2.9,2.8,2.2999999999999998,2.5,2.2999999999999998,2.5,2.2999999999999998,2.2000000000000002,2.2000000000000002,2,1.9,2.2000000000000002,2.1,2.1,1.9,2,2.1,1.9,1.8,1.8,1.1000000000000001,1.6,1.9,1.9,1.6,1.6,1.2,1.6,1.2,1.6,1.2,1,0.9,1.1000000000000001,0.6,1,0.8,0.8,0.8,0.7,0.5,0.1,0.8,-0.5,0,0.2,0.3,0.7,0.1,0.1,0.1,-0.2,0.2,0.3,0.2,0.1,0.4,-0.2,0.1,-0.3,0,0.2,0.4,0.3,0.5,0.7,0.7,1.7,0.4,1.7,2.1,1.5,2,1.3,1.7,1.7,1.9,1.9,1.5,1.7,1.5,1.7,1.5,1.2,1.7,1.3,2.5,2.1,2.2000000000000002,2.1,2.2000000000000002,2.6,2.2000000000000002,1.7,1.9,1.7,1.7,1.4,2.1,1.3,1.5,1.1000000000000001,1,0.9,0.9,1.2,1.5,1.4,1.6,1.7,1.3,0.8,0.5,0.8,0,-0.1,-0.4,-0.5,-0.7,-0.7,0.4,1.6,1.6,2,2.1,2.4,2.1,3.1,3.4,4.0999999999999996,4.5999999999999996,6,5.7,3.2,5.0999999999999996,5.5,7.6,7.8,8.6999999999999993,8.1999999999999993,8.5,8.8000000000000007,10.9,11.6,11.3,9.6,8.6999999999999993,9.1999999999999993,9.3000000000000007,7.8,7.6,6.3,6.8,6.5,6.4,4.3,3,2.2999999999999998,3.8,6,3.1,2.7,2.2999999999999998,2.4,2.8,2.5,2.6,2,1.8]
{"$rows_left_out":30}
{"sheet":"Zeitraum","index":6,"n_rows":192,"n_cols":7,"rows_kept":192,"cut":false,"hidden":true,"merged":[]}
["Zeitraum"]
["2010-01-01",3,193,{"$f":"LOOKUP(C2,B:B,A:A)","v":"2024-09-01"},{"$f":"TEXT(LEFT(Zeitraum,5),\"TT.MM.\")","v":"01.09."},{"$f":"Zeitraum","v":"2024-09-01"},{"$f":"IF(E2=\"31.12.\",\"Jahresdurchschnitt \" & TEXT(Zeitraum,\"JJJJ\"),TEXT(Zeitraum,\"MMMM JJJJ\"))","v":"September 2024"}]
["2010-02-01",4]
["2010-03-01",5]
["2010-04-01",6]
["2010-05-01",7]
["2010-06-01",8]
["2010-07-01",9]
["2010-08-01",10]
["2010-09-01",11]
["2010-10-01",12]
["2010-11-01",13]
["2010-12-01",14]
["2010-12-31",15]
["2011-01-01",16]
{"$rows_left_out":177}